BDBM187632 US9169252, 186
SMILES: CC(C)Nc1cc(ncc1C(=O)NC[C@@H](F)C(C)(C)O)-n1ccc2cnc(N)nc12
InChI Key: InChIKey=VJXZFFLYSZYASO-OAHLLOKOSA-N
Data: 1 IC50
Activity Spreadsheet -- Enzyme Inhibition Constant Data from BindingDB
Found 1 hit for monomerid = 187632
Trg + Lig
Ki
nM
ΔG°
kcal/mole
IC50
nM
Kd
nM
EC50/IC50
nM
koff
s-1
kon
M-1s-1
pHTemp
°C
Interleukin-1 receptor-associated kinase 4
(Homo sapiens (Human))
BDBM187632
(US9169252, 186)
Show SMILES CC(C)Nc1cc(ncc1C(=O)NC[C@@H](F)C(C)(C)O)-n1ccc2cnc(N)nc12 |r|
Show InChI InChI=1S/C20H26FN7O2/c1-11(2)26-14-7-16(28-6-5-12-8-25-19(22)27-17(12)28)23-9-13(14)18(29)24-10-15(21)20(3,4)30/h5-9,11,15,30H,10H2,1-4H3,(H,23,26)(H,24,29)(H2,22,25,27)/t15-/m1/s1
Reactome pathway
US Patent
n/an/a 1.30n/an/an/an/a7.2n/a
Bristol-Myers Squibb Company
US Patent
Assay Description
The assays were performed in U-bottom 384-well plates. The final assay volume was 30 L prepared from 15 L additions of enzyme and substrates (fluores...
US Patent US9169252 (2015)
BindingDB Entry DOI: 10.7270/Q2MP5235