BDBM187817 US9169252, 360
SMILES: CC(C)(O)[C@H](F)CNC(=O)c1cnc(cc1Nc1cnn(CC(F)(F)F)c1)-n1cnc2cc(Cl)cnc12
InChI Key: InChIKey=FRJLFEGHBHXIJT-QGZVFWFLSA-N
Data: 1 IC50
Activity Spreadsheet -- Enzyme Inhibition Constant Data from BindingDB
Found 1 hit for monomerid = 187817
Trg + Lig
Ki
nM
ΔG°
kcal/mole
IC50
nM
Kd
nM
EC50/IC50
nM
koff
s-1
kon
M-1s-1
pHTemp
°C
Interleukin-1 receptor-associated kinase 4
(Homo sapiens (Human))
BDBM187817
(US9169252, 360)
Show SMILES CC(C)(O)[C@H](F)CNC(=O)c1cnc(cc1Nc1cnn(CC(F)(F)F)c1)-n1cnc2cc(Cl)cnc12 |r|
Show InChI InChI=1S/C22H21ClF4N8O2/c1-21(2,37)17(24)8-30-20(36)14-7-28-18(35-11-31-16-3-12(23)5-29-19(16)35)4-15(14)33-13-6-32-34(9-13)10-22(25,26)27/h3-7,9,11,17,37H,8,10H2,1-2H3,(H,28,33)(H,30,36)/t17-/m1/s1
Reactome pathway
US Patent
n/an/a 1.5n/an/an/an/a7.2n/a
Bristol-Myers Squibb Company
US Patent
Assay Description
The assays were performed in U-bottom 384-well plates. The final assay volume was 30 L prepared from 15 L additions of enzyme and substrates (fluores...
US Patent US9169252 (2015)
BindingDB Entry DOI: 10.7270/Q2MP5235