BDBM187922 US9169252, 465
SMILES: CC(C)(O)[C@H](F)CNC(=O)c1cnc(cc1N[C@@H]1CCN(C1)S(C)(=O)=O)-n1ccc2cc(cnc12)C#N
InChI Key: InChIKey=NMHRLANGFQMVRW-YLJYHZDGSA-N
Data: 1 IC50
Activity Spreadsheet -- Enzyme Inhibition Constant Data from BindingDB
Found 1 hit for monomerid = 187922
Trg + Lig
Ki
nM
ΔG°
kcal/mole
IC50
nM
Kd
nM
EC50/IC50
nM
koff
s-1
kon
M-1s-1
pHTemp
°C
Interleukin-1 receptor-associated kinase 4
(Homo sapiens (Human))
BDBM187922
(US9169252, 465)
Show SMILES CC(C)(O)[C@H](F)CNC(=O)c1cnc(cc1N[C@@H]1CCN(C1)S(C)(=O)=O)-n1ccc2cc(cnc12)C#N |r|
Show InChI InChI=1S/C24H28FN7O4S/c1-24(2,34)20(25)13-29-23(33)18-12-27-21(32-7-4-16-8-15(10-26)11-28-22(16)32)9-19(18)30-17-5-6-31(14-17)37(3,35)36/h4,7-9,11-12,17,20,34H,5-6,13-14H2,1-3H3,(H,27,30)(H,29,33)/t17-,20-/m1/s1
Reactome pathway
US Patent
n/an/a 1.30n/an/an/an/a7.2n/a
Bristol-Myers Squibb Company
US Patent
Assay Description
The assays were performed in U-bottom 384-well plates. The final assay volume was 30 L prepared from 15 L additions of enzyme and substrates (fluores...
US Patent US9169252 (2015)
BindingDB Entry DOI: 10.7270/Q2MP5235