BDBM18798 (2S)-2-{[4-({2-amino-6-ethyl-4-oxo-3H,4H,7H-pyrrolo[2,3-d]pyrimidin-5-yl}sulfanyl)phenyl]formamido}pentanedioic acid::Pyrrolo[2,3-d]pyrimidine analogue, 4
SMILES: CCc1[nH]c2nc(N)[nH]c(=O)c2c1Sc1ccc(cc1)C(=O)N[C@@H](CCC(O)=O)C(O)=O
InChI Key: InChIKey=TXULAHBZZCHUNL-LBPRGKRZSA-N
Data: 4 IC50
Activity Spreadsheet -- Enzyme Inhibition Constant Data from BindingDB
Found 4 hits for monomerid = 18798
Trg + Lig
Ki
nM
ΔG°
kcal/mole
IC50
nM
Kd
nM
EC50/IC50
nM
koff
s-1
kon
M-1s-1
pHTemp
°C
Dihydrofolate reductase
(Homo sapiens (Human))
BDBM18798
((2S)-2-{[4-({2-amino-6-ethyl-4-oxo-3H,4H,7H-pyrrol...)
Show SMILES CCc1[nH]c2nc(N)[nH]c(=O)c2c1Sc1ccc(cc1)C(=O)N[C@@H](CCC(O)=O)C(O)=O |r|
Show InChI InChI=1S/C20H21N5O6S/c1-2-11-15(14-16(22-11)24-20(21)25-18(14)29)32-10-5-3-9(4-6-10)17(28)23-12(19(30)31)7-8-13(26)27/h3-6,12H,2,7-8H2,1H3,(H,23,28)(H,26,27)(H,30,31)(H4,21,22,24,25,29)/t12-/m0/s1
NCI pathway
Reactome pathway
n/an/a 420n/an/an/an/a7.430
Duquesne University
Assay Description
DHFRs were assayed spectrophotometrically in the reaction buffer solution containing dihydrofolate. The reaction was initiated with an amount of enzy...
J Med Chem 49: 1055-65 (2006)
Article DOI: 10.1021/jm058276a
BindingDB Entry DOI: 10.7270/Q2833Q90
Thymidylate Synthase (TS)
(Escherichia coli)
BDBM18798
((2S)-2-{[4-({2-amino-6-ethyl-4-oxo-3H,4H,7H-pyrrol...)
Show SMILES CCc1[nH]c2nc(N)[nH]c(=O)c2c1Sc1ccc(cc1)C(=O)N[C@@H](CCC(O)=O)C(O)=O |r|
Show InChI InChI=1S/C20H21N5O6S/c1-2-11-15(14-16(22-11)24-20(21)25-18(14)29)32-10-5-3-9(4-6-10)17(28)23-12(19(30)31)7-8-13(26)27/h3-6,12H,2,7-8H2,1H3,(H,23,28)(H,26,27)(H,30,31)(H4,21,22,24,25,29)/t12-/m0/s1
n/an/a 540n/an/an/an/an/an/a
Duquesne University
Assay Description
TS was assayed spectrophotometrically in the reaction buffer solution containing (6R, 6S)-5, 10-CH2H4folate. The reaction was initiated by the additi...
J Med Chem 49: 1055-65 (2006)
Article DOI: 10.1021/jm058276a
BindingDB Entry DOI: 10.7270/Q2833Q90
Dihydrofolate Reductase (DHFR)
(Escherichia coli)
BDBM18798
((2S)-2-{[4-({2-amino-6-ethyl-4-oxo-3H,4H,7H-pyrrol...)
Show SMILES CCc1[nH]c2nc(N)[nH]c(=O)c2c1Sc1ccc(cc1)C(=O)N[C@@H](CCC(O)=O)C(O)=O |r|
Show InChI InChI=1S/C20H21N5O6S/c1-2-11-15(14-16(22-11)24-20(21)25-18(14)29)32-10-5-3-9(4-6-10)17(28)23-12(19(30)31)7-8-13(26)27/h3-6,12H,2,7-8H2,1H3,(H,23,28)(H,26,27)(H,30,31)(H4,21,22,24,25,29)/t12-/m0/s1
n/an/a>2.10E+4n/an/an/an/an/an/a
Duquesne University
Assay Description
DHFRs were assayed spectrophotometrically in the reaction buffer solution containing dihydrofolate. The reaction was initiated with an amount of enzy...
J Med Chem 49: 1055-65 (2006)
Article DOI: 10.1021/jm058276a
BindingDB Entry DOI: 10.7270/Q2833Q90
Thymidylate synthase
(Homo sapiens (Human))
BDBM18798
((2S)-2-{[4-({2-amino-6-ethyl-4-oxo-3H,4H,7H-pyrrol...)
Show SMILES CCc1[nH]c2nc(N)[nH]c(=O)c2c1Sc1ccc(cc1)C(=O)N[C@@H](CCC(O)=O)C(O)=O |r|
Show InChI InChI=1S/C20H21N5O6S/c1-2-11-15(14-16(22-11)24-20(21)25-18(14)29)32-10-5-3-9(4-6-10)17(28)23-12(19(30)31)7-8-13(26)27/h3-6,12H,2,7-8H2,1H3,(H,23,28)(H,26,27)(H,30,31)(H4,21,22,24,25,29)/t12-/m0/s1
NCI pathway
Reactome pathway
n/an/a 90n/an/an/an/a7.430
Duquesne University
Assay Description
TS was assayed spectrophotometrically in the reaction buffer solution containing (6R, 6S)-5, 10-CH2H4folate. The reaction was initiated by the additi...
J Med Chem 49: 1055-65 (2006)
Article DOI: 10.1021/jm058276a
BindingDB Entry DOI: 10.7270/Q2833Q90