BDBM18804 2-amino-5-[(3-bromophenyl)sulfanyl]-6-ethyl-3H,4H,7H-pyrrolo[2,3-d]pyrimidin-4-one::Pyrrolo[2,3-d]pyrimidine analogue, 12
SMILES: CCc1[nH]c2nc(N)[nH]c(=O)c2c1Sc1cccc(Br)c1
InChI Key: InChIKey=LBPJPXOZNORXCN-UHFFFAOYSA-N
Data: 3 IC50
Activity Spreadsheet -- Enzyme Inhibition Constant Data from BindingDB
Found 3 hits for monomerid = 18804
Trg + Lig
Ki
nM
ΔG°
kcal/mole
IC50
nM
Kd
nM
EC50/IC50
nM
koff
s-1
kon
M-1s-1
pHTemp
°C
Dihydrofolate reductase
(Homo sapiens (Human))
BDBM18804
(2-amino-5-[(3-bromophenyl)sulfanyl]-6-ethyl-3H,4H,...)
Show SMILES CCc1[nH]c2nc(N)[nH]c(=O)c2c1Sc1cccc(Br)c1
Show InChI InChI=1S/C14H13BrN4OS/c1-2-9-11(21-8-5-3-4-7(15)6-8)10-12(17-9)18-14(16)19-13(10)20/h3-6H,2H2,1H3,(H4,16,17,18,19,20)
NCI pathway
Reactome pathway
n/an/a>2.70E+4n/an/an/an/a7.430
Duquesne University
Assay Description
DHFRs were assayed spectrophotometrically in the reaction buffer solution containing dihydrofolate. The reaction was initiated with an amount of enzy...
J Med Chem 49: 1055-65 (2006)
Article DOI: 10.1021/jm058276a
BindingDB Entry DOI: 10.7270/Q2833Q90
Thymidylate Synthase (TS)
(Escherichia coli)
BDBM18804
(2-amino-5-[(3-bromophenyl)sulfanyl]-6-ethyl-3H,4H,...)
Show SMILES CCc1[nH]c2nc(N)[nH]c(=O)c2c1Sc1cccc(Br)c1
Show InChI InChI=1S/C14H13BrN4OS/c1-2-9-11(21-8-5-3-4-7(15)6-8)10-12(17-9)18-14(16)19-13(10)20/h3-6H,2H2,1H3,(H4,16,17,18,19,20)
n/an/a>2.30E+4n/an/an/an/an/an/a
Duquesne University
Assay Description
TS was assayed spectrophotometrically in the reaction buffer solution containing (6R, 6S)-5, 10-CH2H4folate. The reaction was initiated by the additi...
J Med Chem 49: 1055-65 (2006)
Article DOI: 10.1021/jm058276a
BindingDB Entry DOI: 10.7270/Q2833Q90
Thymidylate synthase
(Homo sapiens (Human))
BDBM18804
(2-amino-5-[(3-bromophenyl)sulfanyl]-6-ethyl-3H,4H,...)
Show SMILES CCc1[nH]c2nc(N)[nH]c(=O)c2c1Sc1cccc(Br)c1
Show InChI InChI=1S/C14H13BrN4OS/c1-2-9-11(21-8-5-3-4-7(15)6-8)10-12(17-9)18-14(16)19-13(10)20/h3-6H,2H2,1H3,(H4,16,17,18,19,20)
NCI pathway
Reactome pathway
n/an/a 1.10E+3n/an/an/an/a7.430
Duquesne University
Assay Description
TS was assayed spectrophotometrically in the reaction buffer solution containing (6R, 6S)-5, 10-CH2H4folate. The reaction was initiated by the additi...
J Med Chem 49: 1055-65 (2006)
Article DOI: 10.1021/jm058276a
BindingDB Entry DOI: 10.7270/Q2833Q90