BDBM1885 3-(5-bromopyridin-2-yl)-1-(2-phenylethyl)thiourea::CHEMBL317356::N-(2-Phenethyl)-N -(2-(5-bromopyridyl))thiourea::PETT Analog 52::cid_2429552
SMILES: Brc1ccc(NC(=S)NCCc2ccccc2)nc1
InChI Key: InChIKey=FKDHVFZSRUETTG-UHFFFAOYSA-N
Data: 5 IC50  1 Kd
Activity Spreadsheet -- Enzyme Inhibition Constant Data from BindingDB
Found 6 hits for monomerid = 1885
Trg + Lig
Ki
nM
ΔG°
kcal/mole
IC50
nM
Kd
nM
EC50/IC50
nM
koff
s-1
kon
M-1s-1
pHTemp
°C
HIV-1 Reverse Transcriptase
(Human immunodeficiency virus type 1)
BDBM1885
(3-(5-bromopyridin-2-yl)-1-(2-phenylethyl)thiourea ...)
Show SMILES Brc1ccc(NC(=S)NCCc2ccccc2)nc1
Show InChI InChI=1S/C14H14BrN3S/c15-12-6-7-13(17-10-12)18-14(19)16-9-8-11-4-2-1-3-5-11/h1-7,10H,8-9H2,(H2,16,17,18,19)
n/an/a 15n/an/an/an/a7.837
Lilly Research Laboratories
Assay Description
The IC50 of reverse transcriptase is the concentration that inhibits 50% of recombinant HIV-1 RT RNA-directed DNA polymerase activity in vitro.
J Med Chem 38: 4929-36 (1995)
Article DOI: 10.1021/jm00025a010
BindingDB Entry DOI: 10.7270/Q2639MXG
Coagulation factor XI
(Homo sapiens (Human))
BDBM1885
(3-(5-bromopyridin-2-yl)-1-(2-phenylethyl)thiourea ...)
Show SMILES Brc1ccc(NC(=S)NCCc2ccccc2)nc1
Show InChI InChI=1S/C14H14BrN3S/c15-12-6-7-13(17-10-12)18-14(19)16-9-8-11-4-2-1-3-5-11/h1-7,10H,8-9H2,(H2,16,17,18,19)
Reactome pathway
PCBioAssay
n/an/a>5.00E+4n/an/an/an/a7.423
PCMD
Curated by PubChem BioAssay
Assay Description
Factor XIa (0.23 ug/mL) was incubated with Boc-Glu-Ala-Arg-AMC substrate (15 uM) in 10 uL of assay buffer for 2 hr at room temperature. Read fluoresc...
PubChem Bioassay (2008)
BindingDB Entry DOI: 10.7270/Q2H993J6
Reverse transcriptase
(Human immunodeficiency virus 1)
BDBM1885
(3-(5-bromopyridin-2-yl)-1-(2-phenylethyl)thiourea ...)
Show SMILES Brc1ccc(NC(=S)NCCc2ccccc2)nc1
Show InChI InChI=1S/C14H14BrN3S/c15-12-6-7-13(17-10-12)18-14(19)16-9-8-11-4-2-1-3-5-11/h1-7,10H,8-9H2,(H2,16,17,18,19)
n/an/a 15n/an/an/an/an/an/a
Beactica AB
Curated by ChEMBL
Assay Description
Inhibition of HIV1 reverse transcriptase
J Med Chem 54: 709-18 (2011)
Article DOI: 10.1021/jm101052g
BindingDB Entry DOI: 10.7270/Q22B91T8
Human immunodeficiency virus type 1 reverse transcriptase
(Human immunodeficiency virus 1)
BDBM1885
(3-(5-bromopyridin-2-yl)-1-(2-phenylethyl)thiourea ...)
Show SMILES Brc1ccc(NC(=S)NCCc2ccccc2)nc1
Show InChI InChI=1S/C14H14BrN3S/c15-12-6-7-13(17-10-12)18-14(19)16-9-8-11-4-2-1-3-5-11/h1-7,10H,8-9H2,(H2,16,17,18,19)
n/an/a 1.30E+3n/an/an/an/an/an/a
Institute
Curated by ChEMBL
Assay Description
Inhibition of recombinant HIV-1 reverse transcriptase
Bioorg Med Chem Lett 10: 87-90 (2000)
BindingDB Entry DOI: 10.7270/Q27080NB
Reverse transcriptase
(Human immunodeficiency virus 1)
BDBM1885
(3-(5-bromopyridin-2-yl)-1-(2-phenylethyl)thiourea ...)
Show SMILES Brc1ccc(NC(=S)NCCc2ccccc2)nc1
Show InChI InChI=1S/C14H14BrN3S/c15-12-6-7-13(17-10-12)18-14(19)16-9-8-11-4-2-1-3-5-11/h1-7,10H,8-9H2,(H2,16,17,18,19)
n/an/an/a 2.00E+3n/an/an/an/an/a
Beactica AB
Curated by ChEMBL
Assay Description
Binding affinity to HIV1 reverse transcriptase by surface plasmon resonance based biosensor assay
J Med Chem 54: 709-18 (2011)
Article DOI: 10.1021/jm101052g
BindingDB Entry DOI: 10.7270/Q22B91T8
Kallikrein 5
(Homo sapiens (Human))
BDBM1885
(3-(5-bromopyridin-2-yl)-1-(2-phenylethyl)thiourea ...)
Show SMILES Brc1ccc(NC(=S)NCCc2ccccc2)nc1
Show InChI InChI=1S/C14H14BrN3S/c15-12-6-7-13(17-10-12)18-14(19)16-9-8-11-4-2-1-3-5-11/h1-7,10H,8-9H2,(H2,16,17,18,19)
PCBioAssay
n/an/a 5.00E+4n/an/an/an/an/an/a
PCMD
Curated by PubChem BioAssay
Assay Description
Molecular Library Screening Center Network (MLSCN) Penn Center for Molecular Discovery (PCMD) Assay Provider: Scott L. Diamond, University of Pennsy...
PubChem Bioassay (2008)
BindingDB Entry DOI: 10.7270/Q2GH9GC8