BDBM188707 US9169246, 249
SMILES: CCN(C)c1ncccc1-c1ccc2c3[nH]ncc3c(=O)n(CC(F)(F)F)c2c1
InChI Key: InChIKey=XGSUNCSUCLHLRA-UHFFFAOYSA-N
Data: 1 IC50
Activity Spreadsheet -- Enzyme Inhibition Constant Data from BindingDB
Found 1 hit for monomerid = 188707
Trg + Lig
Ki
nM
ΔG°
kcal/mole
IC50
nM
Kd
nM
EC50/IC50
nM
koff
s-1
kon
M-1s-1
pHTemp
°C
Methionine aminopeptidase 2
(Homo sapiens (Human))
BDBM188707
(US9169246, 249)
Show SMILES CCN(C)c1ncccc1-c1ccc2c3[nH]ncc3c(=O)n(CC(F)(F)F)c2c1
Show InChI InChI=1S/C20H18F3N5O/c1-3-27(2)18-13(5-4-8-24-18)12-6-7-14-16(9-12)28(11-20(21,22)23)19(29)15-10-25-26-17(14)15/h4-10H,3,11H2,1-2H3,(H,25,26)
Reactome pathway
US Patent
n/an/a 4.19n/an/an/an/an/an/a
SANOFI
US Patent
Assay Description
The enzymatic test is a test in two steps.In a first step, it consists in placing in contact the compound according to the invention, the dialysed Me...
US Patent US9169246 (2015)
BindingDB Entry DOI: 10.7270/Q2B856XZ