BDBM188709 US9169246, 251
SMILES: FC(F)(F)Cn1c2cc(ccc2c2[nH]ncc2c1=O)-c1cccnc1N1CCCC1
InChI Key: InChIKey=BSVHOQXLMHDKHC-UHFFFAOYSA-N
Data: 1 IC50
Activity Spreadsheet -- Enzyme Inhibition Constant Data from BindingDB
Found 1 hit for monomerid = 188709
Trg + Lig
Ki
nM
ΔG°
kcal/mole
IC50
nM
Kd
nM
EC50/IC50
nM
koff
s-1
kon
M-1s-1
pHTemp
°C
Methionine aminopeptidase 2
(Homo sapiens (Human))
BDBM188709
(US9169246, 251)
Show SMILES FC(F)(F)Cn1c2cc(ccc2c2[nH]ncc2c1=O)-c1cccnc1N1CCCC1
Show InChI InChI=1S/C21H18F3N5O/c22-21(23,24)12-29-17-10-13(5-6-15(17)18-16(20(29)30)11-26-27-18)14-4-3-7-25-19(14)28-8-1-2-9-28/h3-7,10-11H,1-2,8-9,12H2,(H,26,27)
Reactome pathway
US Patent
n/an/a 5.34n/an/an/an/an/an/a
SANOFI
US Patent
Assay Description
The enzymatic test is a test in two steps.In a first step, it consists in placing in contact the compound according to the invention, the dialysed Me...
US Patent US9169246 (2015)
BindingDB Entry DOI: 10.7270/Q2B856XZ