BDBM189 (5R,6R)-1,5-dibenzyl-6-hydroxy-2,4-bis({[4-(hydroxymethyl)phenyl]methyl})-1,2,4-triazepan-3-one::(5R,6R)-2,4-Bis[(hydroxymethyl)benzyl]-1,5-dibenzyl-6-hydroxy-3-oxo-1,2,4-triazacycloheptane::Azacyclic Urea::Unnamed azacyclic urea
SMILES: OCc1ccc(CN2[C@H](Cc3ccccc3)[C@H](O)CN(Cc3ccccc3)N(Cc3ccc(CO)cc3)C2=O)cc1
InChI Key: InChIKey=ZGLNLADIKLQLDI-CZNDPXEESA-N
Data: 1 KI
Activity Spreadsheet -- Enzyme Inhibition Constant Data from BindingDB
Found 1 hit for monomerid = 189
Trg + Lig
Ki
nM
ΔG°
kcal/mole
IC50
nM
Kd
nM
EC50/IC50
nM
koff
s-1
kon
M-1s-1
pHTemp
°C
HIV-1 Protease
(Human immunodeficiency virus type 1)
BDBM189
((5R,6R)-1,5-dibenzyl-6-hydroxy-2,4-bis({[4-(hydrox...)
Show SMILES OCc1ccc(CN2[C@H](Cc3ccccc3)[C@H](O)CN(Cc3ccccc3)N(Cc3ccc(CO)cc3)C2=O)cc1 |r|
Show InChI InChI=1S/C34H37N3O4/c38-24-30-15-11-28(12-16-30)21-36-32(19-26-7-3-1-4-8-26)33(40)23-35(20-27-9-5-2-6-10-27)37(34(36)41)22-29-13-17-31(25-39)18-14-29/h1-18,32-33,38-40H,19-25H2/t32-,33-/m1/s1
0.220 -13.4n/an/an/an/an/a4.730
Abbott Laboratories
Assay Description
HIV-1 protease activity was measured by a continuous fluorometric assay using the internally quenched fluorogenic substrate DABCYL-GABA-Ser-Gln-Tyr-P...
J Med Chem 39: 392-7 (1996)
Article DOI: 10.1021/jm9507183
BindingDB Entry DOI: 10.7270/Q2V40SC6