BDBM1892 1-[2-(2-ethoxy-6-fluorophenyl)ethyl]-3-(5-methylpyridin-2-yl)thiourea::N-(2-(2-Ethoxy-6-fluorophenylethyl)-N -(2-(5-methylpyridyl))thiourea::PETT Analog 59
SMILES: CCOc1cccc(F)c1CCNC(=S)Nc1ccc(C)cn1
InChI Key: InChIKey=QOWQLJPKVFLTTM-UHFFFAOYSA-N
Data: 1 IC50
Activity Spreadsheet -- Enzyme Inhibition Constant Data from BindingDB
Found 1 hit for monomerid = 1892
Trg + Lig
Ki
nM
ΔG°
kcal/mole
IC50
nM
Kd
nM
EC50/IC50
nM
koff
s-1
kon
M-1s-1
pHTemp
°C
HIV-1 Reverse Transcriptase
(Human immunodeficiency virus type 1)
BDBM1892
(1-[2-(2-ethoxy-6-fluorophenyl)ethyl]-3-(5-methylpy...)
Show SMILES CCOc1cccc(F)c1CCNC(=S)Nc1ccc(C)cn1
Show InChI InChI=1S/C17H20FN3OS/c1-3-22-15-6-4-5-14(18)13(15)9-10-19-17(23)21-16-8-7-12(2)11-20-16/h4-8,11H,3,9-10H2,1-2H3,(H2,19,20,21,23)
n/an/a 4.5n/an/an/an/a7.837
Lilly Research Laboratories
Assay Description
The IC50 of reverse transcriptase is the concentration that inhibits 50% of recombinant HIV-1 RT RNA-directed DNA polymerase activity in vitro.
J Med Chem 38: 4929-36 (1995)
Article DOI: 10.1021/jm00025a010
BindingDB Entry DOI: 10.7270/Q2639MXG