BDBM18925 2-{3,5-dichloro-4-[4-hydroxy-3-(3-phenylphenyl)phenoxy]phenyl}acetic acid::4-hydroxy thyromimetic, 9g
SMILES: OC(=O)Cc1cc(Cl)c(Oc2ccc(O)c(c2)-c2cccc(c2)-c2ccccc2)c(Cl)c1
InChI Key: InChIKey=AQOFZDMQOFEIFY-UHFFFAOYSA-N
Data: 5 IC50
Activity Spreadsheet -- Enzyme Inhibition Constant Data from BindingDB
Found 5 hits for monomerid = 18925
Trg + Lig
Ki
nM
ΔG°
kcal/mole
IC50
nM
Kd
nM
EC50/IC50
nM
koff
s-1
kon
M-1s-1
pHTemp
°C
Thyroid hormone receptor alpha
(Homo sapiens (Human))
BDBM18925
(2-{3,5-dichloro-4-[4-hydroxy-3-(3-phenylphenyl)phe...)
Show SMILES OC(=O)Cc1cc(Cl)c(Oc2ccc(O)c(c2)-c2cccc(c2)-c2ccccc2)c(Cl)c1
Show InChI InChI=1S/C26H18Cl2O4/c27-22-11-16(13-25(30)31)12-23(28)26(22)32-20-9-10-24(29)21(15-20)19-8-4-7-18(14-19)17-5-2-1-3-6-17/h1-12,14-15,29H,13H2,(H,30,31)
NCI pathway
Reactome pathway
n/an/a 454n/an/an/an/a7.04
Bristol-Myers Squibb
Assay Description
IC50 is the concentration of each compound required to inhibit 50% binding of 125I-T3 to hTRalpha.
Bioorg Med Chem Lett 14: 3549-53 (2004)
Article DOI: 10.1016/j.bmcl.2004.04.032
BindingDB Entry DOI: 10.7270/Q2736P5M
Thyroid hormone receptor beta
(Homo sapiens (Human))
BDBM18925
(2-{3,5-dichloro-4-[4-hydroxy-3-(3-phenylphenyl)phe...)
Show SMILES OC(=O)Cc1cc(Cl)c(Oc2ccc(O)c(c2)-c2cccc(c2)-c2ccccc2)c(Cl)c1
Show InChI InChI=1S/C26H18Cl2O4/c27-22-11-16(13-25(30)31)12-23(28)26(22)32-20-9-10-24(29)21(15-20)19-8-4-7-18(14-19)17-5-2-1-3-6-17/h1-12,14-15,29H,13H2,(H,30,31)
NCI pathway
Reactome pathway
n/an/a 21n/an/an/an/an/an/a
Bristol-Myers Squibb
Assay Description
IC50 is the concentration of each compound required to inhibit 50% binding of 125I-T3 to hTRbeta.
Bioorg Med Chem Lett 14: 3549-53 (2004)
Article DOI: 10.1016/j.bmcl.2004.04.032
BindingDB Entry DOI: 10.7270/Q2736P5M
3D
3D Structure (docked)
Thyroid hormone receptor beta
(Homo sapiens (Human))
BDBM18925
(2-{3,5-dichloro-4-[4-hydroxy-3-(3-phenylphenyl)phe...)
Show SMILES OC(=O)Cc1cc(Cl)c(Oc2ccc(O)c(c2)-c2cccc(c2)-c2ccccc2)c(Cl)c1
Show InChI InChI=1S/C26H18Cl2O4/c27-22-11-16(13-25(30)31)12-23(28)26(22)32-20-9-10-24(29)21(15-20)19-8-4-7-18(14-19)17-5-2-1-3-6-17/h1-12,14-15,29H,13H2,(H,30,31)
NCI pathway
Reactome pathway
n/an/a 20.9n/an/an/an/an/an/a
Universidade de S£o Paulo
Curated by ChEMBL
Assay Description
Inhibition of thyroid hormone receptor beta
Bioorg Med Chem 15: 4609-17 (2007)
Article DOI: 10.1016/j.bmc.2007.04.015
BindingDB Entry DOI: 10.7270/Q2W37XJQ
3D
3D Structure (docked)
Thyroid hormone receptor alpha
(Homo sapiens (Human))
BDBM18925
(2-{3,5-dichloro-4-[4-hydroxy-3-(3-phenylphenyl)phe...)
Show SMILES OC(=O)Cc1cc(Cl)c(Oc2ccc(O)c(c2)-c2cccc(c2)-c2ccccc2)c(Cl)c1
Show InChI InChI=1S/C26H18Cl2O4/c27-22-11-16(13-25(30)31)12-23(28)26(22)32-20-9-10-24(29)21(15-20)19-8-4-7-18(14-19)17-5-2-1-3-6-17/h1-12,14-15,29H,13H2,(H,30,31)
NCI pathway
Reactome pathway
n/an/a 457n/an/an/an/an/an/a
Universidade de S£o Paulo
Curated by ChEMBL
Assay Description
Inhibition of thyroid hormone receptor alpha
Bioorg Med Chem 15: 4609-17 (2007)
Article DOI: 10.1016/j.bmc.2007.04.015
BindingDB Entry DOI: 10.7270/Q2W37XJQ
Thyroid hormone receptor beta
(Homo sapiens (Human))
BDBM18925
(2-{3,5-dichloro-4-[4-hydroxy-3-(3-phenylphenyl)phe...)
Show SMILES OC(=O)Cc1cc(Cl)c(Oc2ccc(O)c(c2)-c2cccc(c2)-c2ccccc2)c(Cl)c1
Show InChI InChI=1S/C26H18Cl2O4/c27-22-11-16(13-25(30)31)12-23(28)26(22)32-20-9-10-24(29)21(15-20)19-8-4-7-18(14-19)17-5-2-1-3-6-17/h1-12,14-15,29H,13H2,(H,30,31)
NCI pathway
Reactome pathway
n/an/a 20.9n/an/an/an/an/an/a
University of Insubria
Curated by ChEMBL
Assay Description
Inhibition of human thyroid hormone receptor beta 1
Bioorg Med Chem 15: 5251-61 (2007)
Article DOI: 10.1016/j.bmc.2007.05.016
BindingDB Entry DOI: 10.7270/Q2PK0HD8
3D
3D Structure (docked)