null
SMILES: CCCSc1nnc2n(-c3ccccc3)c(=O)c3c(C)c(C)sc3n12
InChI Key: InChIKey=HMHCDRWOANPTIA-UHFFFAOYSA-N
Activity Spreadsheet -- Enzyme Inhibition Constant Data from BindingDB
Found 2 hits for monomerid = 189300
Trg + Lig
Ki
nM
ΔG°
kcal/mole
IC50
nM
Kd
nM
EC50/IC50
nM
koff
s-1
kon
M-1s-1
pHTemp
°C
cAMP and cAMP-inhibited cGMP 3',5'-cyclic phosphodiesterase 10A
(Homo sapiens (Human))
BDBM189300
(US9173884, BC11-8 )
Show SMILES CCCSc1nnc2n(-c3ccccc3)c(=O)c3c(C)c(C)sc3n12
Show InChI InChI=1S/C18H18N4OS2/c1-4-10-24-18-20-19-17-21(13-8-6-5-7-9-13)15(23)14-11(2)12(3)25-16(14)22(17)18/h5-9H,4,10H2,1-3H3
Reactome pathway
US Patent
n/an/a 200n/an/an/an/an/an/a
Trustees of Boston College
US Patent
Assay Description
In vitro enzyme assays were conducted via the Ba(OH)2 precipitation method of Wang et al. (32) using recombinant human PDE11A4, PDE10A1, PDE5A1, PDE6...
US Patent US9173884 (2015)
BindingDB Entry DOI: 10.7270/Q2PK0DZ6
Dual 3',5'-cyclic-AMP and -GMP phosphodiesterase 11A
(Homo sapiens (Human))
BDBM189300
(US9173884, BC11-8 )
Show SMILES CCCSc1nnc2n(-c3ccccc3)c(=O)c3c(C)c(C)sc3n12
Show InChI InChI=1S/C18H18N4OS2/c1-4-10-24-18-20-19-17-21(13-8-6-5-7-9-13)15(23)14-11(2)12(3)25-16(14)22(17)18/h5-9H,4,10H2,1-3H3
US Patent
n/an/a 50n/an/an/an/an/an/a
Trustees of Boston College
US Patent
Assay Description
In vitro enzyme assays were conducted via the Ba(OH)2 precipitation method of Wang et al. (32) using recombinant human PDE11A4, PDE10A1, PDE5A1, PDE6...
US Patent US9173884 (2015)
BindingDB Entry DOI: 10.7270/Q2PK0DZ6