BDBM189316 US9173884, BC11-28-6
SMILES: Cc1ccccc1Nc1ncnc2n(cc(-c3ccccc3)c12)-c1ccccc1
InChI Key: InChIKey=RCNRIXNNEMQBAG-UHFFFAOYSA-N
Data: 1 IC50
Activity Spreadsheet -- Enzyme Inhibition Constant Data from BindingDB
Found 1 hit for monomerid = 189316
Trg + Lig
Ki
nM
ΔG°
kcal/mole
IC50
nM
Kd
nM
EC50/IC50
nM
koff
s-1
kon
M-1s-1
pHTemp
°C
Phosphodiesterase 11A (PDE11A)
(Homo sapiens (Human))
BDBM189316
(US9173884, BC11-28-6)
Show SMILES Cc1ccccc1Nc1ncnc2n(cc(-c3ccccc3)c12)-c1ccccc1
Show InChI InChI=1S/C25H20N4/c1-18-10-8-9-15-22(18)28-24-23-21(19-11-4-2-5-12-19)16-29(25(23)27-17-26-24)20-13-6-3-7-14-20/h2-17H,1H3,(H,26,27,28)
US Patent
n/an/a<200n/an/an/an/an/an/a
Trustees of Boston College
US Patent
Assay Description
In vitro enzyme assays were conducted via the Ba(OH)2 precipitation method of Wang et al. (32) using recombinant human PDE11A4, PDE10A1, PDE5A1, PDE6...
US Patent US9173884 (2015)
BindingDB Entry DOI: 10.7270/Q2PK0DZ6