null
SMILES: CC(=O)N1CCC(C)(c2ccccc2)c2cc(NC(=O)OCc3ccc(F)c(Cl)c3)ccc12
InChI Key: InChIKey=IRWJUAWYXLTKDV-UHFFFAOYSA-N
Activity Spreadsheet -- Enzyme Inhibition Constant Data from BindingDB
Found 2 hits for monomerid = 189329
Trg + Lig
Ki
nM
ΔG°
kcal/mole
IC50
nM
Kd
nM
EC50/IC50
nM
koff
s-1
kon
M-1s-1
pHTemp
°C
Thyrotropin receptor
(Homo sapiens (Human))
BDBM189329
((+)-(1-Acetyl-4-methyl-4-phenyl-1,2,3,4-tetrahydro...)
Show SMILES CC(=O)N1CCC(C)(c2ccccc2)c2cc(NC(=O)OCc3ccc(F)c(Cl)c3)ccc12
Show InChI InChI=1S/C26H24ClFN2O3/c1-17(31)30-13-12-26(2,19-6-4-3-5-7-19)21-15-20(9-11-24(21)30)29-25(32)33-16-18-8-10-23(28)22(27)14-18/h3-11,14-15H,12-13,16H2,1-2H3,(H,29,32)
US Patent
n/an/a 47n/an/an/an/an/an/a
Merck Sharp & Dohme B.V.
US Patent
Assay Description
Antagonist activity of three test compounds against human TSI at the human TSH receptor was tested in Chinese Hamster Ovary (CHO) cells (cultured 16 ...
US Patent US9174940 (2015)
BindingDB Entry DOI: 10.7270/Q2F18XJC
Thyrotropin subunit beta
(Bos taurus (Bovine))
BDBM189329
((+)-(1-Acetyl-4-methyl-4-phenyl-1,2,3,4-tetrahydro...)
Show SMILES CC(=O)N1CCC(C)(c2ccccc2)c2cc(NC(=O)OCc3ccc(F)c(Cl)c3)ccc12
Show InChI InChI=1S/C26H24ClFN2O3/c1-17(31)30-13-12-26(2,19-6-4-3-5-7-19)21-15-20(9-11-24(21)30)29-25(32)33-16-18-8-10-23(28)22(27)14-18/h3-11,14-15H,12-13,16H2,1-2H3,(H,29,32)
US Patent
n/an/a 192n/an/an/an/an/an/a
Merck Sharp & Dohme B.V.
US Patent
Assay Description
Antagonist activity of three test compounds against human TSI at the human TSH receptor was tested in Chinese Hamster Ovary (CHO) cells (cultured 16 ...
US Patent US9174940 (2015)
BindingDB Entry DOI: 10.7270/Q2F18XJC