null
SMILES: Fc1cc(NC(=O)N[C@@H]2[C@H]3Oc4ccc(Oc5ccnc6NC(=O)CCc56)cc4[C@@H]23)cc(F)c1F
InChI Key: InChIKey=LVVRHAVPVOVPGG-UHFFFAOYSA-N
Activity Spreadsheet -- Enzyme Inhibition Constant Data from BindingDB
Found 2 hits for monomerid = 189357
Trg + Lig
Ki
nM
ΔG°
kcal/mole
IC50
nM
Kd
nM
EC50/IC50
nM
koff
s-1
kon
M-1s-1
pHTemp
°C
RAF proto-oncogene serine/threonine-protein kinase [306-648,Y340D,Y341D]
(Homo sapiens (Human))
BDBM189357
(US9670203, Compound 1.47)
Show SMILES Fc1cc(NC(=O)N[C@@H]2[C@H]3Oc4ccc(Oc5ccnc6NC(=O)CCc56)cc4[C@@H]23)cc(F)c1F |r|
Show InChI InChI=1S/C17H23NO2/c1-13-17(2,3)14-9-6-7-10-15(14)18(13)12-8-4-5-11-16(19)20/h6-7,9-10H,1,4-5,8,11-12H2,2-3H3,(H,19,20)
US Patent
n/an/a 530n/an/an/an/an/a25
BeiGene, Ltd.
US Patent
Assay Description
Compounds disclosed herein were tested against B-Raf (V600E) (PV3849, from Invitrogen) or C-Raf (Y340D/Y341D) (PV3805, from Invitrogen) in a time-res...
US Patent US9670203 (2017)
BindingDB Entry DOI: 10.7270/Q20Z71F5
Serine/threonine-protein kinase B-raf [416-766,V600E]
(Homo sapiens (Human))
BDBM189357
(US9670203, Compound 1.47)
Show SMILES Fc1cc(NC(=O)N[C@@H]2[C@H]3Oc4ccc(Oc5ccnc6NC(=O)CCc56)cc4[C@@H]23)cc(F)c1F |r|
Show InChI InChI=1S/C17H23NO2/c1-13-17(2,3)14-9-6-7-10-15(14)18(13)12-8-4-5-11-16(19)20/h6-7,9-10H,1,4-5,8,11-12H2,2-3H3,(H,19,20)
US Patent
n/an/a 4.10E+3n/an/an/an/an/a25
BeiGene, Ltd.
US Patent
Assay Description
Compounds disclosed herein were tested against B-Raf (V600E) (PV3849, from Invitrogen) or C-Raf (Y340D/Y341D) (PV3805, from Invitrogen) in a time-res...
US Patent US9670203 (2017)
BindingDB Entry DOI: 10.7270/Q20Z71F5