BDBM189373 N-(2-bromobenzyl)-8-imino-2-oxo-2H,8H-pyrano[2,3-f]chromene-9-carboxamide (4l)
SMILES: Brc1ccccc1CNC(=O)c1cc2c(ccc3ccc(=O)oc23)oc1=N
InChI Key: InChIKey=ZKUXSUHJJYUNLF-UHFFFAOYSA-N
Data: 1 IC50
Activity Spreadsheet -- Enzyme Inhibition Constant Data from BindingDB
Found 1 hit for monomerid = 189373
Trg + Lig
Ki
nM
ΔG°
kcal/mole
IC50
nM
Kd
nM
EC50/IC50
nM
koff
s-1
kon
M-1s-1
pHTemp
°C
Acetylcholinesterase
(Electrophorus electricus (Electric eel))
BDBM189373
(N-(2-bromobenzyl)-8-imino-2-oxo-2H,8H-pyrano[2,3-f...)
Show SMILES Brc1ccccc1CNC(=O)c1cc2c(ccc3ccc(=O)oc23)oc1=N
Show InChI InChI=1S/C20H13BrN2O4/c21-15-4-2-1-3-12(15)10-23-20(25)14-9-13-16(26-19(14)22)7-5-11-6-8-17(24)27-18(11)13/h1-9,22H,10H2,(H,23,25)
n/an/a 27n/an/an/an/a7.7n/a
Yogi Vemana University
Assay Description
In brief, reaction mixture composed of 10 µL of test sample of five different concentrations, 145 µL phosphate buffer 200 mM (pH 7.7), 80 µL of dithi...
Chem Biol Drug Des 88: 43-53 (2016)
Article DOI: 10.1111/cbdd.12732
BindingDB Entry DOI: 10.7270/Q2HT2N4Z