BDBM189377 N-(4-(tert-butyl)benzyl)-8-imino-4-methyl-2-oxo-2H,8H-pyrano[2,3-f]chromene-9-carboxamide (4p)
SMILES: Cc1cc(=O)oc2c1ccc1oc(=N)c(cc21)C(=O)NCc1ccc(cc1)C(C)(C)C
InChI Key: InChIKey=UMTKCFJRDJJORY-UHFFFAOYSA-N
Data: 3 IC50
Activity Spreadsheet -- Enzyme Inhibition Constant Data from BindingDB
Found 3 hits for monomerid = 189377
Trg + Lig
Ki
nM
ΔG°
kcal/mole
IC50
nM
Kd
nM
EC50/IC50
nM
koff
s-1
kon
M-1s-1
pHTemp
°C
Acetylcholinesterase
(Electrophorus electricus (Electric eel))
BDBM189377
(N-(4-(tert-butyl)benzyl)-8-imino-4-methyl-2-oxo-2H...)
Show SMILES Cc1cc(=O)oc2c1ccc1oc(=N)c(cc21)C(=O)NCc1ccc(cc1)C(C)(C)C
Show InChI InChI=1S/C25H24N2O4/c1-14-11-21(28)31-22-17(14)9-10-20-18(22)12-19(23(26)30-20)24(29)27-13-15-5-7-16(8-6-15)25(2,3)4/h5-12,26H,13H2,1-4H3,(H,27,29)
n/an/a 77n/an/an/an/a7.7n/a
Yogi Vemana University
Assay Description
In brief, reaction mixture composed of 10 µL of test sample of five different concentrations, 145 µL phosphate buffer 200 mM (pH 7.7), 80 µL of dithi...
Chem Biol Drug Des 88: 43-53 (2016)
Article DOI: 10.1111/cbdd.12732
BindingDB Entry DOI: 10.7270/Q2HT2N4Z
Acetylcholinesterase
(Electrophorus electricus (Electric eel))
BDBM189377
(N-(4-(tert-butyl)benzyl)-8-imino-4-methyl-2-oxo-2H...)
Show SMILES Cc1cc(=O)oc2c1ccc1oc(=N)c(cc21)C(=O)NCc1ccc(cc1)C(C)(C)C
Show InChI InChI=1S/C25H24N2O4/c1-14-11-21(28)31-22-17(14)9-10-20-18(22)12-19(23(26)30-20)24(29)27-13-15-5-7-16(8-6-15)25(2,3)4/h5-12,26H,13H2,1-4H3,(H,27,29)
n/an/a 10n/an/an/an/an/an/a
Yogi Vemana University
Curated by ChEMBL
Assay Description
Inhibition of electric eel AChE using acetylthiocholine iodide as substrate preincubated for 5 mins followed by substrate addition measured after 5 m...
Eur J Med Chem 107: 219-32 (2016)
Article DOI: 10.1016/j.ejmech.2015.10.046
BindingDB Entry DOI: 10.7270/Q2JW8HWF
Cholinesterase
(Equus caballus (Horse))
BDBM189377
(N-(4-(tert-butyl)benzyl)-8-imino-4-methyl-2-oxo-2H...)
Show SMILES Cc1cc(=O)oc2c1ccc1oc(=N)c(cc21)C(=O)NCc1ccc(cc1)C(C)(C)C
Show InChI InChI=1S/C25H24N2O4/c1-14-11-21(28)31-22-17(14)9-10-20-18(22)12-19(23(26)30-20)24(29)27-13-15-5-7-16(8-6-15)25(2,3)4/h5-12,26H,13H2,1-4H3,(H,27,29)
n/an/a 5.79E+4n/an/an/an/an/an/a
Yogi Vemana University
Curated by ChEMBL
Assay Description
Inhibition of horse serum butyrylcholinesterase using butyrylthiocholine iodide as substrate preincubated for 5 mins followed by substrate addition m...
Eur J Med Chem 107: 219-32 (2016)
Article DOI: 10.1016/j.ejmech.2015.10.046
BindingDB Entry DOI: 10.7270/Q2JW8HWF