BDBM189414 US9174974, Comparator 3
SMILES: CCS(=O)(=O)c1ccc2NC(=O)OCCc3c(C)cc(cc3C)[C@@H](Nc3ccc4c(N)nccc4c3)C(=O)NCc1c2
InChI Key: InChIKey=MYGIQCOFJNZEGJ-MUUNZHRXSA-N
Data: 2 KI
Activity Spreadsheet -- Enzyme Inhibition Constant Data from BindingDB
Found 2 hits for monomerid = 189414
Trg + Lig
Ki
nM
ΔG°
kcal/mole
IC50
nM
Kd
nM
EC50/IC50
nM
koff
s-1
kon
M-1s-1
pHTemp
°C
Coagulation factor VII
(Homo sapiens (Human))
BDBM189414
(US9174974, Comparator 3)
Show SMILES CCS(=O)(=O)c1ccc2NC(=O)OCCc3c(C)cc(cc3C)[C@@H](Nc3ccc4c(N)nccc4c3)C(=O)NCc1c2 |r|
Show InChI InChI=1S/C31H33N5O5S/c1-4-42(39,40)27-8-6-24-16-22(27)17-34-30(37)28(35-23-5-7-26-20(15-23)9-11-33-29(26)32)21-13-18(2)25(19(3)14-21)10-12-41-31(38)36-24/h5-9,11,13-16,28,35H,4,10,12,17H2,1-3H3,(H2,32,33)(H,34,37)(H,36,38)/t28-/m1/s1
Reactome pathway
US Patent
1.10n/an/an/an/an/an/an/an/a
Bristol-Myers Squibb Company
US Patent
Assay Description
FVIIa-Xase Ki (37° C.): S2765 (0.5 mM), PCPS (25 μM), calcium chloride (5 mM), full-length human TF (3 nM), human FVIIa (5 pM), and FVIIa inhibi...
US Patent US9174974 (2015)
BindingDB Entry DOI: 10.7270/Q2W37V32
Coagulation factor VII
(Homo sapiens (Human))
BDBM189414
(US9174974, Comparator 3)
Show SMILES CCS(=O)(=O)c1ccc2NC(=O)OCCc3c(C)cc(cc3C)[C@@H](Nc3ccc4c(N)nccc4c3)C(=O)NCc1c2 |r|
Show InChI InChI=1S/C31H33N5O5S/c1-4-42(39,40)27-8-6-24-16-22(27)17-34-30(37)28(35-23-5-7-26-20(15-23)9-11-33-29(26)32)21-13-18(2)25(19(3)14-21)10-12-41-31(38)36-24/h5-9,11,13-16,28,35H,4,10,12,17H2,1-3H3,(H2,32,33)(H,34,37)(H,36,38)/t28-/m1/s1
Reactome pathway
US Patent
70n/an/an/an/an/an/a7.4n/a
Bristol-Myers Squibb Company
US Patent
Assay Description
Tissue kallikrein-1 (37° C) activity was determined in reactions containing 0.05 nM enzyme and 90 μM substrate (H-D-Val-Leu-Arg-AFC) in buffer (...
US Patent US9174974 (2015)
BindingDB Entry DOI: 10.7270/Q2W37V32