BDBM189421 US9174974, Example 6
SMILES: COC[C@H](C)S(=O)(=O)c1ccc2NC(=O)OC[C@H](C)c3ccc(cc3C)[C@@H](Nc3ccc4c(N)ncc(F)c4c3)C(=O)N(C)Cc1c2
InChI Key: InChIKey=VYJWGKABPOAADG-VAKBQEFHSA-N
Data: 2 KI
Activity Spreadsheet -- Enzyme Inhibition Constant Data from BindingDB
Found 2 hits for monomerid = 189421
Trg + Lig
Ki
nM
ΔG°
kcal/mole
IC50
nM
Kd
nM
EC50/IC50
nM
koff
s-1
kon
M-1s-1
pHTemp
°C
Coagulation factor VII
(Homo sapiens (Human))
BDBM189421
(US9174974, Example 6)
Show SMILES COC[C@H](C)S(=O)(=O)c1ccc2NC(=O)OC[C@H](C)c3ccc(cc3C)[C@@H](Nc3ccc4c(N)ncc(F)c4c3)C(=O)N(C)Cc1c2 |r|
Show InChI InChI=1S/C34H38FN5O6S/c1-19-12-22-6-9-26(19)20(2)17-46-34(42)39-24-8-11-30(47(43,44)21(3)18-45-5)23(13-24)16-40(4)33(41)31(22)38-25-7-10-27-28(14-25)29(35)15-37-32(27)36/h6-15,20-21,31,38H,16-18H2,1-5H3,(H2,36,37)(H,39,42)/t20-,21-,31+/m0/s1
Reactome pathway
US Patent
1.80n/an/an/an/an/an/an/an/a
Bristol-Myers Squibb Company
US Patent
Assay Description
FVIIa-Xase Ki (37° C.): S2765 (0.5 mM), PCPS (25 μM), calcium chloride (5 mM), full-length human TF (3 nM), human FVIIa (5 pM), and FVIIa inhibi...
US Patent US9174974 (2015)
BindingDB Entry DOI: 10.7270/Q2W37V32
Coagulation factor VII
(Homo sapiens (Human))
BDBM189421
(US9174974, Example 6)
Show SMILES COC[C@H](C)S(=O)(=O)c1ccc2NC(=O)OC[C@H](C)c3ccc(cc3C)[C@@H](Nc3ccc4c(N)ncc(F)c4c3)C(=O)N(C)Cc1c2 |r|
Show InChI InChI=1S/C34H38FN5O6S/c1-19-12-22-6-9-26(19)20(2)17-46-34(42)39-24-8-11-30(47(43,44)21(3)18-45-5)23(13-24)16-40(4)33(41)31(22)38-25-7-10-27-28(14-25)29(35)15-37-32(27)36/h6-15,20-21,31,38H,16-18H2,1-5H3,(H2,36,37)(H,39,42)/t20-,21-,31+/m0/s1
Reactome pathway
US Patent
550n/an/an/an/an/an/a7.4n/a
Bristol-Myers Squibb Company
US Patent
Assay Description
Tissue kallikrein-1 (37° C) activity was determined in reactions containing 0.05 nM enzyme and 90 μM substrate (H-D-Val-Leu-Arg-AFC) in buffer (...
US Patent US9174974 (2015)
BindingDB Entry DOI: 10.7270/Q2W37V32