BDBM189436 US9174974, Example 21
SMILES: C[C@H]1COC(=O)Nc2cc(F)c(OC[C@H](O)C3CC3)c(CN(C)C(=O)[C@H](Nc3ccc4c(N)nccc4c3)c3ccc1c(C)c3)c2
InChI Key: InChIKey=HFDCUKRAPMJLPO-HNHWTWCFSA-N
Data: 2 KI
Activity Spreadsheet -- Enzyme Inhibition Constant Data from BindingDB
Found 2 hits for monomerid = 189436
Trg + Lig
Ki
nM
ΔG°
kcal/mole
IC50
nM
Kd
nM
EC50/IC50
nM
koff
s-1
kon
M-1s-1
pHTemp
°C
Coagulation factor VII
(Homo sapiens (Human))
BDBM189436
(US9174974, Example 21)
Show SMILES C[C@H]1COC(=O)Nc2cc(F)c(OC[C@H](O)C3CC3)c(CN(C)C(=O)[C@H](Nc3ccc4c(N)nccc4c3)c3ccc1c(C)c3)c2 |r|
Show InChI InChI=1S/C35H38FN5O5/c1-19-12-23-6-8-27(19)20(2)17-46-35(44)40-26-14-24(32(29(36)15-26)45-18-30(42)21-4-5-21)16-41(3)34(43)31(23)39-25-7-9-28-22(13-25)10-11-38-33(28)37/h6-15,20-21,30-31,39,42H,4-5,16-18H2,1-3H3,(H2,37,38)(H,40,44)/t20-,30-,31+/m0/s1
Reactome pathway
US Patent
0.340n/an/an/an/an/an/an/an/a
Bristol-Myers Squibb Company
US Patent
Assay Description
FVIIa-Xase Ki (37° C.): S2765 (0.5 mM), PCPS (25 μM), calcium chloride (5 mM), full-length human TF (3 nM), human FVIIa (5 pM), and FVIIa inhibi...
US Patent US9174974 (2015)
BindingDB Entry DOI: 10.7270/Q2W37V32
Coagulation factor VII
(Homo sapiens (Human))
BDBM189436
(US9174974, Example 21)
Show SMILES C[C@H]1COC(=O)Nc2cc(F)c(OC[C@H](O)C3CC3)c(CN(C)C(=O)[C@H](Nc3ccc4c(N)nccc4c3)c3ccc1c(C)c3)c2 |r|
Show InChI InChI=1S/C35H38FN5O5/c1-19-12-23-6-8-27(19)20(2)17-46-35(44)40-26-14-24(32(29(36)15-26)45-18-30(42)21-4-5-21)16-41(3)34(43)31(23)39-25-7-9-28-22(13-25)10-11-38-33(28)37/h6-15,20-21,30-31,39,42H,4-5,16-18H2,1-3H3,(H2,37,38)(H,40,44)/t20-,30-,31+/m0/s1
Reactome pathway
US Patent
550n/an/an/an/an/an/a7.4n/a
Bristol-Myers Squibb Company
US Patent
Assay Description
Tissue kallikrein-1 (37° C) activity was determined in reactions containing 0.05 nM enzyme and 90 μM substrate (H-D-Val-Leu-Arg-AFC) in buffer (...
US Patent US9174974 (2015)
BindingDB Entry DOI: 10.7270/Q2W37V32