BDBM18945 2-{3,5-dibromo-4-[4-hydroxy-3-(4-hydroxyphenoxy)phenoxy]phenyl}acetic acid::4-hydroxy thyromimetic, 13h
SMILES: OC(=O)Cc1cc(Br)c(Oc2ccc(O)c(Oc3ccc(O)cc3)c2)c(Br)c1
InChI Key: InChIKey=DFUILVXTAGCSOH-UHFFFAOYSA-N
Data: 5 IC50
Activity Spreadsheet -- Enzyme Inhibition Constant Data from BindingDB
Found 5 hits for monomerid = 18945
Trg + Lig
Ki
nM
ΔG°
kcal/mole
IC50
nM
Kd
nM
EC50/IC50
nM
koff
s-1
kon
M-1s-1
pHTemp
°C
Thyroid hormone receptor alpha
(Homo sapiens (Human))
BDBM18945
(2-{3,5-dibromo-4-[4-hydroxy-3-(4-hydroxyphenoxy)ph...)
Show SMILES OC(=O)Cc1cc(Br)c(Oc2ccc(O)c(Oc3ccc(O)cc3)c2)c(Br)c1
Show InChI InChI=1S/C20H14Br2O6/c21-15-7-11(9-19(25)26)8-16(22)20(15)28-14-5-6-17(24)18(10-14)27-13-3-1-12(23)2-4-13/h1-8,10,23-24H,9H2,(H,25,26)
NCI pathway
Reactome pathway
n/an/a 237n/an/an/an/an/an/a
Bristol-Myers Squibb
Assay Description
IC50 is the concentration of each compound required to inhibit 50% binding of 125I-T3 to hTRalpha.
Bioorg Med Chem Lett 14: 3549-53 (2004)
Article DOI: 10.1016/j.bmcl.2004.04.032
BindingDB Entry DOI: 10.7270/Q2736P5M
Thyroid hormone receptor beta
(Homo sapiens (Human))
BDBM18945
(2-{3,5-dibromo-4-[4-hydroxy-3-(4-hydroxyphenoxy)ph...)
Show SMILES OC(=O)Cc1cc(Br)c(Oc2ccc(O)c(Oc3ccc(O)cc3)c2)c(Br)c1
Show InChI InChI=1S/C20H14Br2O6/c21-15-7-11(9-19(25)26)8-16(22)20(15)28-14-5-6-17(24)18(10-14)27-13-3-1-12(23)2-4-13/h1-8,10,23-24H,9H2,(H,25,26)
NCI pathway
Reactome pathway
n/an/a 6n/an/an/an/an/an/a
Bristol-Myers Squibb
Assay Description
IC50 is the concentration of each compound required to inhibit 50% binding of 125I-T3 to hTRbeta.
Bioorg Med Chem Lett 14: 3549-53 (2004)
Article DOI: 10.1016/j.bmcl.2004.04.032
BindingDB Entry DOI: 10.7270/Q2736P5M
Thyroid hormone receptor beta
(Homo sapiens (Human))
BDBM18945
(2-{3,5-dibromo-4-[4-hydroxy-3-(4-hydroxyphenoxy)ph...)
Show SMILES OC(=O)Cc1cc(Br)c(Oc2ccc(O)c(Oc3ccc(O)cc3)c2)c(Br)c1
Show InChI InChI=1S/C20H14Br2O6/c21-15-7-11(9-19(25)26)8-16(22)20(15)28-14-5-6-17(24)18(10-14)27-13-3-1-12(23)2-4-13/h1-8,10,23-24H,9H2,(H,25,26)
NCI pathway
Reactome pathway
n/an/a 6.03n/an/an/an/an/an/a
Universidade de S£o Paulo
Curated by ChEMBL
Assay Description
Inhibition of thyroid hormone receptor beta
Bioorg Med Chem 15: 4609-17 (2007)
Article DOI: 10.1016/j.bmc.2007.04.015
BindingDB Entry DOI: 10.7270/Q2W37XJQ
Thyroid hormone receptor alpha
(Homo sapiens (Human))
BDBM18945
(2-{3,5-dibromo-4-[4-hydroxy-3-(4-hydroxyphenoxy)ph...)
Show SMILES OC(=O)Cc1cc(Br)c(Oc2ccc(O)c(Oc3ccc(O)cc3)c2)c(Br)c1
Show InChI InChI=1S/C20H14Br2O6/c21-15-7-11(9-19(25)26)8-16(22)20(15)28-14-5-6-17(24)18(10-14)27-13-3-1-12(23)2-4-13/h1-8,10,23-24H,9H2,(H,25,26)
NCI pathway
Reactome pathway
n/an/a 240n/an/an/an/an/an/a
Universidade de S£o Paulo
Curated by ChEMBL
Assay Description
Inhibition of thyroid hormone receptor alpha
Bioorg Med Chem 15: 4609-17 (2007)
Article DOI: 10.1016/j.bmc.2007.04.015
BindingDB Entry DOI: 10.7270/Q2W37XJQ
Thyroid hormone receptor beta
(Homo sapiens (Human))
BDBM18945
(2-{3,5-dibromo-4-[4-hydroxy-3-(4-hydroxyphenoxy)ph...)
Show SMILES OC(=O)Cc1cc(Br)c(Oc2ccc(O)c(Oc3ccc(O)cc3)c2)c(Br)c1
Show InChI InChI=1S/C20H14Br2O6/c21-15-7-11(9-19(25)26)8-16(22)20(15)28-14-5-6-17(24)18(10-14)27-13-3-1-12(23)2-4-13/h1-8,10,23-24H,9H2,(H,25,26)
NCI pathway
Reactome pathway
n/an/a 6.03n/an/an/an/an/an/a
University of Insubria
Curated by ChEMBL
Assay Description
Inhibition of human thyroid hormone receptor beta 1
Bioorg Med Chem 15: 5251-61 (2007)
Article DOI: 10.1016/j.bmc.2007.05.016
BindingDB Entry DOI: 10.7270/Q2PK0HD8