null
SMILES: CC1(C)CC(=C(CN2CCN(CC2)c2ccc(C(=O)NS(=O)(=O)c3ccc(OCC4COCCO4)c(c3)[N+]([O-])=O)c(Oc3cnc4[nH]ccc4c3)c2)CO1)c1ccc(Cl)cc1
InChI Key:
Activity Spreadsheet -- Enzyme Inhibition Constant Data from BindingDB
Found 3 hits for monomerid = 189480
Trg + Lig
Ki
nM
ΔG°
kcal/mole
IC50
nM
Kd
nM
EC50/IC50
nM
koff
s-1
kon
M-1s-1
pHTemp
°C
Apoptosis regulator Bcl-2
(Homo sapiens (Human))
BDBM189480
(US10213433, Compound 32 | US11369599, Compound 32 ...)
Show SMILES CC1(C)CC(=C(CN2CCN(CC2)c2ccc(C(=O)NS(=O)(=O)c3ccc(OCC4COCCO4)c(c3)[N+]([O-])=O)c(Oc3cnc4[nH]ccc4c3)c2)CO1)c1ccc(Cl)cc1 |t:4|
US Patent
<0.0100<-15.0n/an/an/an/an/an/a25
ABBVIE INC.; GENENTECH, INC.; THE WALTER AND ELIZA HALL INSTITUTE OF MEDICAL RESEARCH
US Patent
Assay Description
Representative compounds were serially diluted in dimethyl sulfoxide (DMSO) starting at 50 uM (2x starting concentration; 10% DMSO) and 10 uL were tr...
US Patent US9174982 (2015)
BindingDB Entry DOI: 10.7270/Q2RB73D5
Apoptosis regulator Bcl-2
(Homo sapiens (Human))
BDBM189480
(US10213433, Compound 32 | US11369599, Compound 32 ...)
Show SMILES CC1(C)CC(=C(CN2CCN(CC2)c2ccc(C(=O)NS(=O)(=O)c3ccc(OCC4COCCO4)c(c3)[N+]([O-])=O)c(Oc3cnc4[nH]ccc4c3)c2)CO1)c1ccc(Cl)cc1 |t:4|
<0.0100n/an/an/an/an/an/an/an/a
TBA
Citation and Details
BindingDB Entry DOI: 10.7270/Q21V5J59
Apoptosis regulator Bcl-2
(Homo sapiens (Human))
BDBM189480
(US10213433, Compound 32 | US11369599, Compound 32 ...)
Show SMILES CC1(C)CC(=C(CN2CCN(CC2)c2ccc(C(=O)NS(=O)(=O)c3ccc(OCC4COCCO4)c(c3)[N+]([O-])=O)c(Oc3cnc4[nH]ccc4c3)c2)CO1)c1ccc(Cl)cc1 |t:4|
US Patent
<0.0100n/an/an/an/an/an/an/an/a
AbbVie Inc.
US Patent
Assay Description
TR-FRET (Time-Resolved Fluorescence-Resonance-Energy-Transfer) assay.
US Patent US10213433 (2019)
BindingDB Entry DOI: 10.7270/Q23F4RZ6