BDBM189483 US10213433, Compound 35::US9174982, 35
SMILES: CC1(C)CC(=C(CN2CCN(CC2)c2ccc(C(=O)NS(=O)(=O)c3cnc(OCC4CCOCC4)c(c3)C#N)c(Oc3cnc4[nH]ccc4c3)c2)CO1)c1ccc(Cl)cc1
InChI Key: InChIKey=UCIVEFFDWYGDNP-UHFFFAOYSA-N
Data: 2 KI
Activity Spreadsheet -- Enzyme Inhibition Constant Data from BindingDB
Found 2 hits for monomerid = 189483
Trg + Lig
Ki
nM
ΔG°
kcal/mole
IC50
nM
Kd
nM
EC50/IC50
nM
koff
s-1
kon
M-1s-1
pHTemp
°C
Apoptosis regulator Bcl-2
(Homo sapiens (Human))
BDBM189483
(US10213433, Compound 35 | US9174982, 35)
Show SMILES CC1(C)CC(=C(CN2CCN(CC2)c2ccc(C(=O)NS(=O)(=O)c3cnc(OCC4CCOCC4)c(c3)C#N)c(Oc3cnc4[nH]ccc4c3)c2)CO1)c1ccc(Cl)cc1 |t:4|
Show InChI InChI=1S/C44H46ClN7O7S/c1-44(2)22-39(30-3-5-34(45)6-4-30)33(28-58-44)26-51-13-15-52(16-14-51)35-7-8-38(40(21-35)59-36-19-31-9-12-47-41(31)48-24-36)42(53)50-60(54,55)37-20-32(23-46)43(49-25-37)57-27-29-10-17-56-18-11-29/h3-9,12,19-21,24-25,29H,10-11,13-18,22,26-28H2,1-2H3,(H,47,48)(H,50,53)
US Patent
<0.0100n/an/an/an/an/an/an/an/a
AbbVie Inc.
US Patent
Assay Description
TR-FRET (Time-Resolved Fluorescence-Resonance-Energy-Transfer) assay.
US Patent US10213433 (2019)
BindingDB Entry DOI: 10.7270/Q23F4RZ6
Apoptosis regulator Bcl-2
(Homo sapiens (Human))
BDBM189483
(US10213433, Compound 35 | US9174982, 35)
Show SMILES CC1(C)CC(=C(CN2CCN(CC2)c2ccc(C(=O)NS(=O)(=O)c3cnc(OCC4CCOCC4)c(c3)C#N)c(Oc3cnc4[nH]ccc4c3)c2)CO1)c1ccc(Cl)cc1 |t:4|
Show InChI InChI=1S/C44H46ClN7O7S/c1-44(2)22-39(30-3-5-34(45)6-4-30)33(28-58-44)26-51-13-15-52(16-14-51)35-7-8-38(40(21-35)59-36-19-31-9-12-47-41(31)48-24-36)42(53)50-60(54,55)37-20-32(23-46)43(49-25-37)57-27-29-10-17-56-18-11-29/h3-9,12,19-21,24-25,29H,10-11,13-18,22,26-28H2,1-2H3,(H,47,48)(H,50,53)
US Patent
<0.0100<-15.0n/an/an/an/an/an/a25
ABBVIE INC.; GENENTECH, INC.; THE WALTER AND ELIZA HALL INSTITUTE OF MEDICAL RESEARCH
US Patent
Assay Description
Representative compounds were serially diluted in dimethyl sulfoxide (DMSO) starting at 50 uM (2x starting concentration; 10% DMSO) and 10 uL were tr...
US Patent US9174982 (2015)
BindingDB Entry DOI: 10.7270/Q2RB73D5