null
SMILES: COC1CCC(CNc2ccc(cc2[N+]([O-])=O)S(=O)(=O)NC(=O)c2ccc(cc2Oc2cnc3[nH]ccc3c2)N2CCN(CC3=C(CC(C)(C)OC3)c3ccc(Cl)cc3)CC2)CC1
InChI Key: InChIKey=HSIPILLOKFOTJP-UHFFFAOYSA-N
Activity Spreadsheet -- Enzyme Inhibition Constant Data from BindingDB
Found 1 hit for monomerid = 189520
Trg + Lig
Ki
nM
ΔG°
kcal/mole
IC50
nM
Kd
nM
EC50/IC50
nM
koff
s-1
kon
M-1s-1
pHTemp
°C
Apoptosis regulator Bcl-2
(Homo sapiens (Human))
BDBM189520
(US9174982, 72)
Show SMILES COC1CCC(CNc2ccc(cc2[N+]([O-])=O)S(=O)(=O)NC(=O)c2ccc(cc2Oc2cnc3[nH]ccc3c2)N2CCN(CC3=C(CC(C)(C)OC3)c3ccc(Cl)cc3)CC2)CC1 |t:48,(-11.38,3.51,;-10.61,2.18,;-9.07,2.18,;-8.3,.84,;-6.76,.84,;-5.99,2.18,;-4.45,2.18,;-3.68,3.51,;-2.14,3.51,;-1.37,2.18,;.17,2.18,;.94,3.51,;.17,4.84,;-1.37,4.84,;-2.14,6.18,;-1.37,7.51,;-3.68,6.18,;2.48,3.51,;2.48,5.05,;4.02,3.51,;2.48,1.97,;3.81,1.2,;5.15,1.97,;3.81,-.34,;5.15,-1.11,;5.15,-2.65,;3.81,-3.42,;2.48,-2.65,;2.48,-1.11,;1.15,-.34,;-.19,-1.11,;-.19,-2.65,;-1.52,-3.42,;-2.85,-2.65,;-4.32,-3.12,;-5.22,-1.88,;-4.32,-.63,;-2.85,-1.11,;-1.52,-.34,;3.81,-4.96,;5.15,-5.73,;5.15,-7.27,;3.81,-8.04,;3.81,-9.58,;5.15,-10.35,;5.15,-11.89,;6.48,-12.66,;7.81,-11.89,;8.63,-13.19,;9.35,-11.94,;7.81,-10.35,;6.48,-9.58,;3.81,-12.66,;3.81,-14.2,;2.48,-14.97,;1.15,-14.2,;-.19,-14.97,;1.15,-12.66,;2.48,-11.89,;2.48,-7.27,;2.48,-5.73,;-6.76,3.51,;-8.3,3.51,)|
Show InChI InChI=1S/C46H52ClN7O8S/c1-46(2)25-40(31-6-8-34(47)9-7-31)33(29-61-46)28-52-18-20-53(21-19-52)35-10-14-39(43(23-35)62-37-22-32-16-17-48-44(32)50-27-37)45(55)51-63(58,59)38-13-15-41(42(24-38)54(56)57)49-26-30-4-11-36(60-3)12-5-30/h6-10,13-17,22-24,27,30,36,49H,4-5,11-12,18-21,25-26,28-29H2,1-3H3,(H,48,50)(H,51,55)
US Patent
<0.0100<-15.0n/an/an/an/an/an/a25
ABBVIE INC.; GENENTECH, INC.; THE WALTER AND ELIZA HALL INSTITUTE OF MEDICAL RESEARCH
US Patent
Assay Description
Representative compounds were serially diluted in dimethyl sulfoxide (DMSO) starting at 50 uM (2x starting concentration; 10% DMSO) and 10 uL were tr...
US Patent US9174982 (2015)
BindingDB Entry DOI: 10.7270/Q2RB73D5