BDBM189754 US10213433, Compound 324::US9174982, 324
SMILES: O[C@H]1CC[C@H](CNc2ccc(cc2[N+]([O-])=O)S(=O)(=O)NC(=O)c2ccc(cc2Oc2cnc3[nH]ccc3c2)N2CCN(CC3=C(CCC(F)(F)C3)c3ccc(Cl)cc3)CC2)CC1
InChI Key: InChIKey=HOSBWWFZNONMAQ-BPGAUYIHSA-N
Data: 2 KI
Activity Spreadsheet -- Enzyme Inhibition Constant Data from BindingDB
Found 2 hits for monomerid = 189754
Trg + Lig
Ki
nM
ΔG°
kcal/mole
IC50
nM
Kd
nM
EC50/IC50
nM
koff
s-1
kon
M-1s-1
pHTemp
°C
Apoptosis regulator Bcl-2
(Homo sapiens (Human))
BDBM189754
(US10213433, Compound 324 | US9174982, 324)
Show SMILES O[C@H]1CC[C@H](CNc2ccc(cc2[N+]([O-])=O)S(=O)(=O)NC(=O)c2ccc(cc2Oc2cnc3[nH]ccc3c2)N2CCN(CC3=C(CCC(F)(F)C3)c3ccc(Cl)cc3)CC2)CC1 |wU:4.4,wD:1.0,t:47,(-11.34,6.22,;-9.8,6.22,;-9.03,4.89,;-7.49,4.89,;-6.72,6.22,;-5.18,6.22,;-4.41,7.56,;-2.87,7.56,;-2.1,6.22,;-.56,6.22,;.21,7.56,;-.56,8.89,;-2.1,8.89,;-2.87,10.22,;-2.1,11.56,;-4.41,10.22,;1.75,7.56,;1.75,9.1,;3.29,7.56,;1.75,6.02,;3.08,5.25,;4.42,6.02,;3.08,3.71,;4.42,2.94,;4.42,1.4,;3.08,.63,;1.75,1.4,;1.75,2.94,;.42,3.71,;-.92,2.94,;-.92,1.4,;-2.25,.63,;-3.58,1.4,;-5.05,.92,;-5.95,2.17,;-5.05,3.41,;-3.58,2.94,;-2.25,3.71,;3.08,-.91,;4.42,-1.68,;4.42,-3.22,;3.08,-3.99,;3.08,-5.53,;4.42,-6.3,;4.42,-7.84,;5.75,-8.61,;7.08,-7.84,;7.08,-6.3,;8.62,-6.25,;7.9,-5,;5.75,-5.53,;3.08,-8.61,;3.08,-10.15,;1.75,-10.92,;.42,-10.15,;-.92,-10.92,;.42,-8.61,;1.75,-7.84,;1.75,-3.22,;1.75,-1.68,;-7.49,7.56,;-9.03,7.56,)|
Show InChI InChI=1S/C44H46ClF2N7O7S/c45-32-5-3-29(4-6-32)37-13-15-44(46,47)24-31(37)27-52-17-19-53(20-18-52)33-7-11-38(41(22-33)61-35-21-30-14-16-48-42(30)50-26-35)43(56)51-62(59,60)36-10-12-39(40(23-36)54(57)58)49-25-28-1-8-34(55)9-2-28/h3-7,10-12,14,16,21-23,26,28,34,49,55H,1-2,8-9,13,15,17-20,24-25,27H2,(H,48,50)(H,51,56)/t28-,34-
US Patent
<0.0100n/an/an/an/an/an/an/an/a
AbbVie Inc.
US Patent
Assay Description
TR-FRET (Time-Resolved Fluorescence-Resonance-Energy-Transfer) assay.
US Patent US10213433 (2019)
BindingDB Entry DOI: 10.7270/Q23F4RZ6
Apoptosis regulator Bcl-2
(Homo sapiens (Human))
BDBM189754
(US10213433, Compound 324 | US9174982, 324)
Show SMILES O[C@H]1CC[C@H](CNc2ccc(cc2[N+]([O-])=O)S(=O)(=O)NC(=O)c2ccc(cc2Oc2cnc3[nH]ccc3c2)N2CCN(CC3=C(CCC(F)(F)C3)c3ccc(Cl)cc3)CC2)CC1 |wU:4.4,wD:1.0,t:47,(-11.34,6.22,;-9.8,6.22,;-9.03,4.89,;-7.49,4.89,;-6.72,6.22,;-5.18,6.22,;-4.41,7.56,;-2.87,7.56,;-2.1,6.22,;-.56,6.22,;.21,7.56,;-.56,8.89,;-2.1,8.89,;-2.87,10.22,;-2.1,11.56,;-4.41,10.22,;1.75,7.56,;1.75,9.1,;3.29,7.56,;1.75,6.02,;3.08,5.25,;4.42,6.02,;3.08,3.71,;4.42,2.94,;4.42,1.4,;3.08,.63,;1.75,1.4,;1.75,2.94,;.42,3.71,;-.92,2.94,;-.92,1.4,;-2.25,.63,;-3.58,1.4,;-5.05,.92,;-5.95,2.17,;-5.05,3.41,;-3.58,2.94,;-2.25,3.71,;3.08,-.91,;4.42,-1.68,;4.42,-3.22,;3.08,-3.99,;3.08,-5.53,;4.42,-6.3,;4.42,-7.84,;5.75,-8.61,;7.08,-7.84,;7.08,-6.3,;8.62,-6.25,;7.9,-5,;5.75,-5.53,;3.08,-8.61,;3.08,-10.15,;1.75,-10.92,;.42,-10.15,;-.92,-10.92,;.42,-8.61,;1.75,-7.84,;1.75,-3.22,;1.75,-1.68,;-7.49,7.56,;-9.03,7.56,)|
Show InChI InChI=1S/C44H46ClF2N7O7S/c45-32-5-3-29(4-6-32)37-13-15-44(46,47)24-31(37)27-52-17-19-53(20-18-52)33-7-11-38(41(22-33)61-35-21-30-14-16-48-42(30)50-26-35)43(56)51-62(59,60)36-10-12-39(40(23-36)54(57)58)49-25-28-1-8-34(55)9-2-28/h3-7,10-12,14,16,21-23,26,28,34,49,55H,1-2,8-9,13,15,17-20,24-25,27H2,(H,48,50)(H,51,56)/t28-,34-
US Patent
<0.0100<-15.0n/an/an/an/an/an/a25
ABBVIE INC.; GENENTECH, INC.; THE WALTER AND ELIZA HALL INSTITUTE OF MEDICAL RESEARCH
US Patent
Assay Description
Representative compounds were serially diluted in dimethyl sulfoxide (DMSO) starting at 50 uM (2x starting concentration; 10% DMSO) and 10 uL were tr...
US Patent US9174982 (2015)
BindingDB Entry DOI: 10.7270/Q2RB73D5