null
SMILES: C[C@H]1CN(CC[C@H]1c1cn(C)c2ncc(NC(=O)c3cccc(c3)C#N)c(c12)C(F)(F)F)C(=O)C1CCCC1
InChI Key: InChIKey=ZCHCREODKCYHAI-LAUBAEHRSA-N
Activity Spreadsheet -- Enzyme Inhibition Constant Data from BindingDB
Found 4 hits for monomerid = 190325
Trg + Lig
Ki
nM
ΔG°
kcal/mole
IC50
nM
Kd
nM
EC50/IC50
nM
koff
s-1
kon
M-1s-1
pHTemp
°C
Nuclear receptor ROR-gamma
(Homo sapiens (Human))
BDBM190325
(US10227346, Example 81 | US10426135, Example 81 | ...)
Show SMILES C[C@H]1CN(CC[C@H]1c1cn(C)c2ncc(NC(=O)c3cccc(c3)C#N)c(c12)C(F)(F)F)C(=O)C1CCCC1 |r|
Show InChI InChI=1S/C29H30F3N5O2/c1-17-15-37(28(39)19-7-3-4-8-19)11-10-21(17)22-16-36(2)26-24(22)25(29(30,31)32)23(14-34-26)35-27(38)20-9-5-6-18(12-20)13-33/h5-6,9,12,14,16-17,19,21H,3-4,7-8,10-11,15H2,1-2H3,(H,35,38)/t17-,21+/m0/s1
US Patent
n/an/a 1.20n/an/an/an/a7.525
Pfizer Inc.
US Patent
Assay Description
Specifically, in one embodiment the aforementioned assay was performed as outlined below. The assay was carried out in black polystyrene, 384-well pl...
US Patent US9670201 (2017)
BindingDB Entry DOI: 10.7270/Q28G8HWT
Nuclear receptor ROR-gamma
(Homo sapiens (Human))
BDBM190325
(US10227346, Example 81 | US10426135, Example 81 | ...)
Show SMILES C[C@H]1CN(CC[C@H]1c1cn(C)c2ncc(NC(=O)c3cccc(c3)C#N)c(c12)C(F)(F)F)C(=O)C1CCCC1 |r|
Show InChI InChI=1S/C29H30F3N5O2/c1-17-15-37(28(39)19-7-3-4-8-19)11-10-21(17)22-16-36(2)26-24(22)25(29(30,31)32)23(14-34-26)35-27(38)20-9-5-6-18(12-20)13-33/h5-6,9,12,14,16-17,19,21H,3-4,7-8,10-11,15H2,1-2H3,(H,35,38)/t17-,21+/m0/s1
US Patent
n/an/a 1.20n/an/an/an/an/an/a
Pfizer Inc.
US Patent
Assay Description
The activity of compound of the invention can be determined by a co-activator recruitment by TR-FRET (time-resolved fluorescence resonance energy tra...
US Patent US10426135 (2019)
BindingDB Entry DOI: 10.7270/Q23N25QB
Nuclear receptor ROR-gamma
(Homo sapiens (Human))
BDBM190325
(US10227346, Example 81 | US10426135, Example 81 | ...)
Show SMILES C[C@H]1CN(CC[C@H]1c1cn(C)c2ncc(NC(=O)c3cccc(c3)C#N)c(c12)C(F)(F)F)C(=O)C1CCCC1 |r|
Show InChI InChI=1S/C29H30F3N5O2/c1-17-15-37(28(39)19-7-3-4-8-19)11-10-21(17)22-16-36(2)26-24(22)25(29(30,31)32)23(14-34-26)35-27(38)20-9-5-6-18(12-20)13-33/h5-6,9,12,14,16-17,19,21H,3-4,7-8,10-11,15H2,1-2H3,(H,35,38)/t17-,21+/m0/s1
US Patent
n/an/a 1.20n/an/an/an/an/an/a
Montana State University
J Med Chem 50: 4928-38 (2007)
BindingDB Entry DOI: 10.7270/Q2GH9M91
Nuclear receptor ROR-gamma
(Homo sapiens (Human))
BDBM190325
(US10227346, Example 81 | US10426135, Example 81 | ...)
Show SMILES C[C@H]1CN(CC[C@H]1c1cn(C)c2ncc(NC(=O)c3cccc(c3)C#N)c(c12)C(F)(F)F)C(=O)C1CCCC1 |r|
Show InChI InChI=1S/C29H30F3N5O2/c1-17-15-37(28(39)19-7-3-4-8-19)11-10-21(17)22-16-36(2)26-24(22)25(29(30,31)32)23(14-34-26)35-27(38)20-9-5-6-18(12-20)13-33/h5-6,9,12,14,16-17,19,21H,3-4,7-8,10-11,15H2,1-2H3,(H,35,38)/t17-,21+/m0/s1
US Patent
n/an/a 1.20n/an/an/an/an/an/a
Universita di Napoli
Assay Description
The activity of compound of the invention can be determined by a co-activator recruitment by TR-FRET (time-resolved fluorescence resonance energy tra...
J Med Chem 51: 1764-70 (2008)
BindingDB Entry DOI: 10.7270/Q2SF2ZGV