BDBM19042 6-(1-{2-[(diethylamino)methyl]phenyl}piperidin-4-yl)-1-(4-methoxyphenyl)-7-oxo-1H,4H,5H,6H,7H-pyrazolo[3,4-c]pyridine-3-carboxamide::Pyrazole-based inhibitor containing N-arylpiperidiny, 16g
SMILES: CCN(CC)Cc1ccccc1N1CCC(CC1)N1CCc2c(nn(c2C1=O)-c1ccc(OC)cc1)C(N)=O
InChI Key: InChIKey=ITHCVPPZUXPRGP-UHFFFAOYSA-N
Data: 1 KI
Activity Spreadsheet -- Enzyme Inhibition Constant Data from BindingDB
Found 1 hit for monomerid = 19042
Trg + Lig
Ki
nM
ΔG°
kcal/mole
IC50
nM
Kd
nM
EC50/IC50
nM
koff
s-1
kon
M-1s-1
pHTemp
°C
Coagulation factor X
(Homo sapiens (Human))
BDBM19042
(6-(1-{2-[(diethylamino)methyl]phenyl}piperidin-4-y...)
Show SMILES CCN(CC)Cc1ccccc1N1CCC(CC1)N1CCc2c(nn(c2C1=O)-c1ccc(OC)cc1)C(N)=O
Show InChI InChI=1S/C30H38N6O3/c1-4-33(5-2)20-21-8-6-7-9-26(21)34-17-14-22(15-18-34)35-19-16-25-27(29(31)37)32-36(28(25)30(35)38)23-10-12-24(39-3)13-11-23/h6-13,22H,4-5,14-20H2,1-3H3,(H2,31,37)
Reactome pathway
0.260 -12.9n/an/an/an/an/a7.022
Bristol-Myers Squibb Company
Assay Description
Ki values were obtained from human purified enzyme. All assays were run in microtiter plates. Plates were read for 30 min at 405 nm. Rates were deter...
Bioorg Med Chem Lett 17: 1432-7 (2007)
Article DOI: 10.1016/j.bmcl.2006.11.071
BindingDB Entry DOI: 10.7270/Q2KD1W5D