BDBM190529 US9181184, 15
SMILES: CN(C)C(=O)OCCN1C[C@H](O)[C@@H](O)[C@H](O)[C@H]1CO
InChI Key: InChIKey=CBTNGLNOAULTHM-UTINFBMNSA-N
Data: 1 EC50
Activity Spreadsheet -- Enzyme Inhibition Constant Data from BindingDB
Found 1 hit for monomerid = 190529
Trg + Lig
Ki
nM
ΔG°
kcal/mole
IC50
nM
Kd
nM
EC50/IC50
nM
koff
s-1
kon
M-1s-1
pHTemp
°C
alpha-glucosidase (Gaa)
(Mus musculus (Mouse))
BDBM190529
(US9181184, 15)
Show SMILES CN(C)C(=O)OCCN1C[C@H](O)[C@@H](O)[C@H](O)[C@H]1CO |r|
Show InChI InChI=1S/C11H22N2O6/c1-12(2)11(18)19-4-3-13-5-8(15)10(17)9(16)7(13)6-14/h7-10,14-17H,3-6H2,1-2H3/t7-,8+,9-,10-/m1/s1
US Patent
n/an/an/an/a 5.84E+5n/an/a4.0n/a
Amicus Therapeutics, Inc.
US Patent
Assay Description
Cells were washed two times with 200 μL dPBS followed by the addition of 70 μL of substrate (2.11 mM 3 mM 4-MU-α-D-glu) in citrate-pho...
US Patent US9181184 (2015)
BindingDB Entry DOI: 10.7270/Q2T43RWB