BDBM190530 US9181184, 16
SMILES: CC(C)(C)OC(=O)N1CCC(CN2C[C@H](O)[C@@H](O)[C@H](O)[C@H]2CO)CC1
InChI Key: InChIKey=OYCTVSLEPFRWFR-LXTVHRRPSA-N
Data: 1 EC50
Activity Spreadsheet -- Enzyme Inhibition Constant Data from BindingDB
Found 1 hit for monomerid = 190530
Trg + Lig
Ki
nM
ΔG°
kcal/mole
IC50
nM
Kd
nM
EC50/IC50
nM
koff
s-1
kon
M-1s-1
pHTemp
°C
alpha-glucosidase (Gaa)
(Mus musculus (Mouse))
BDBM190530
(US9181184, 16)
Show SMILES CC(C)(C)OC(=O)N1CCC(CN2C[C@H](O)[C@@H](O)[C@H](O)[C@H]2CO)CC1 |r|
Show InChI InChI=1S/C17H32N2O6/c1-17(2,3)25-16(24)18-6-4-11(5-7-18)8-19-9-13(21)15(23)14(22)12(19)10-20/h11-15,20-23H,4-10H2,1-3H3/t12-,13+,14-,15-/m1/s1
US Patent
n/an/an/an/a 6.97E+4n/an/a4.0n/a
Amicus Therapeutics, Inc.
US Patent
Assay Description
Cells were washed two times with 200 μL dPBS followed by the addition of 70 μL of substrate (2.11 mM 3 mM 4-MU-α-D-glu) in citrate-pho...
US Patent US9181184 (2015)
BindingDB Entry DOI: 10.7270/Q2T43RWB