BDBM190761 US9181236, 58
SMILES: COc1cccc2cc([nH]c12)-c1cc(Cl)c(s1)[C@]1(C)CS(=O)(=O)C2(CCC2)C(=N)N1
InChI Key:
Data: 2 KI
Activity Spreadsheet -- Enzyme Inhibition Constant Data from BindingDB
Found 2 hits for monomerid = 190761
Trg + Lig
Ki
nM
ΔG°
kcal/mole
IC50
nM
Kd
nM
EC50/IC50
nM
koff
s-1
kon
M-1s-1
pHTemp
°C
Beta-secretase 2
(Homo sapiens (Human))
BDBM190761
(US9181236, 58)
Show SMILES COc1cccc2cc([nH]c12)-c1cc(Cl)c(s1)[C@]1(C)CS(=O)(=O)C2(CCC2)C(=N)N1 |r|
US Patent
1 -12.5n/an/an/an/an/a5.030
Merck Sharp & Dohme Corp.
US Patent
Assay Description
Inhibitor IC50s at purified human autoBACE-2 are determined in a time-resolved endpoint proteolysis assay that measures hydrolysis of the QSY7-EISE...
US Patent US9181236 (2015)
BindingDB Entry DOI: 10.7270/Q2NC5ZZB
Beta-secretase 1
(Homo sapiens (Human))
BDBM190761
(US9181236, 58)
Show SMILES COc1cccc2cc([nH]c12)-c1cc(Cl)c(s1)[C@]1(C)CS(=O)(=O)C2(CCC2)C(=N)N1 |r|
US Patent
7.70 -11.2n/an/an/an/an/a5.030
Merck Sharp & Dohme Corp.
US Patent
Assay Description
A homogeneous time-resolved FRET assay can be used to determine IC50 values for inhibitors of the soluble human BACE1 catalytic domain. This assay mo...
US Patent US9181236 (2015)
BindingDB Entry DOI: 10.7270/Q2NC5ZZB