BDBM191055 US9181253, 117
SMILES: CC(C)Nc1nc(Cl)nc2n(cnc12)[C@]12C[C@H]1[C@@H](O)[C@@H](O)C2
InChI Key: InChIKey=UXSFRUIFTAPXIE-AGZVQKLTSA-N
Data: 2 KI
Activity Spreadsheet -- Enzyme Inhibition Constant Data from BindingDB
Found 2 hits for monomerid = 191055
Trg + Lig
Ki
nM
ΔG°
kcal/mole
IC50
nM
Kd
nM
EC50/IC50
nM
koff
s-1
kon
M-1s-1
pHTemp
°C
Adenosine receptor A3
(Homo sapiens (Human))
BDBM191055
(US9181253, 117)
Show SMILES CC(C)Nc1nc(Cl)nc2n(cnc12)[C@]12C[C@H]1[C@@H](O)[C@@H](O)C2 |r|
Show InChI InChI=1S/C14H18ClN5O2/c1-6(2)17-11-9-12(19-13(15)18-11)20(5-16-9)14-3-7(14)10(22)8(21)4-14/h5-8,10,21-22H,3-4H2,1-2H3,(H,17,18,19)/t7-,8-,10+,14-/m0/s1
US Patent
12 -10.8n/an/an/an/an/a7.525
The United States of America, as represented by the Secretary, Department of Health and Human Services
US Patent
Assay Description
Radioligand binding assays at A1, A2A, and A3ARs were performed according to the procedures described previously. Each tube in the binding assay cont...
US Patent US9181253 (2015)
BindingDB Entry DOI: 10.7270/Q2CV4GJ4
Adenosine receptor A1
(Homo sapiens (Human))
BDBM191055
(US9181253, 117)
Show SMILES CC(C)Nc1nc(Cl)nc2n(cnc12)[C@]12C[C@H]1[C@@H](O)[C@@H](O)C2 |r|
Show InChI InChI=1S/C14H18ClN5O2/c1-6(2)17-11-9-12(19-13(15)18-11)20(5-16-9)14-3-7(14)10(22)8(21)4-14/h5-8,10,21-22H,3-4H2,1-2H3,(H,17,18,19)/t7-,8-,10+,14-/m0/s1
Reactome pathway
US Patent
72.2 -9.74n/an/an/an/an/a7.525
The United States of America, as represented by the Secretary, Department of Health and Human Services
US Patent
Assay Description
Radioligand binding assays at A1, A2A, and A3ARs were performed according to the procedures described previously. Each tube in the binding assay cont...
US Patent US9181253 (2015)
BindingDB Entry DOI: 10.7270/Q2CV4GJ4