BDBM191074 US9181258, 82
SMILES: CN1CCN(Cc2ccc(cc2)-c2c(cc3C(=O)NCC(CCOC(=O)C(F)(F)F)n23)-c2cccc(OC(F)(F)F)c2)CC1
InChI Key: InChIKey=QQKNGMZFTNVAKG-UHFFFAOYSA-N
Data: 2 IC50
Activity Spreadsheet -- Enzyme Inhibition Constant Data from BindingDB
Found 2 hits for monomerid = 191074
Trg + Lig
Ki
nM
ΔG°
kcal/mole
IC50
nM
Kd
nM
EC50/IC50
nM
koff
s-1
kon
M-1s-1
pHTemp
°C
Serine/threonine-protein kinase pim-2
(Homo sapiens (Human))
BDBM191074
(US9181258, 82)
Show SMILES CN1CCN(Cc2ccc(cc2)-c2c(cc3C(=O)NCC(CCOC(=O)C(F)(F)F)n23)-c2cccc(OC(F)(F)F)c2)CC1
Show InChI InChI=1S/C30H30F6N4O4/c1-38-10-12-39(13-11-38)18-19-5-7-20(8-6-19)26-24(21-3-2-4-23(15-21)44-30(34,35)36)16-25-27(41)37-17-22(40(25)26)9-14-43-28(42)29(31,32)33/h2-8,15-16,22H,9-14,17-18H2,1H3,(H,37,41)
US Patent
n/an/a 35n/an/an/an/a7.5n/a
NERVIANO MEDICAL SCIENCES S.R.L.
US Patent
Assay Description
The inhibitory activity of putative kinase inhibitors and the potency of selected compounds were determined using a trans-phosphorylation assay.Speci...
US Patent US9181258 (2015)
BindingDB Entry DOI: 10.7270/Q2862F7F
Serine/threonine-protein kinase pim-1
(Homo sapiens (Human))
BDBM191074
(US9181258, 82)
Show SMILES CN1CCN(Cc2ccc(cc2)-c2c(cc3C(=O)NCC(CCOC(=O)C(F)(F)F)n23)-c2cccc(OC(F)(F)F)c2)CC1
Show InChI InChI=1S/C30H30F6N4O4/c1-38-10-12-39(13-11-38)18-19-5-7-20(8-6-19)26-24(21-3-2-4-23(15-21)44-30(34,35)36)16-25-27(41)37-17-22(40(25)26)9-14-43-28(42)29(31,32)33/h2-8,15-16,22H,9-14,17-18H2,1H3,(H,37,41)
US Patent
n/an/a 1n/an/an/an/a7.5n/a
NERVIANO MEDICAL SCIENCES S.R.L.
US Patent
Assay Description
The inhibitory activity of putative kinase inhibitors and the potency of selected compounds were determined using a trans-phosphorylation assay. Spec...
US Patent US9181258 (2015)
BindingDB Entry DOI: 10.7270/Q2862F7F