BDBM191078 US9181258, 92
SMILES: Cc1cccc(c1)-c1c(cc2C(=O)NC[C@H](CCN)n12)-c1cccc(OC(F)(F)F)c1
InChI Key: InChIKey=QRVJKXOAMVIRHV-KRWDZBQOSA-N
Data: 2 IC50
Activity Spreadsheet -- Enzyme Inhibition Constant Data from BindingDB
Found 2 hits for monomerid = 191078
Trg + Lig
Ki
nM
ΔG°
kcal/mole
IC50
nM
Kd
nM
EC50/IC50
nM
koff
s-1
kon
M-1s-1
pHTemp
°C
Serine/threonine-protein kinase pim-2
(Homo sapiens (Human))
BDBM191078
(US9181258, 92)
Show SMILES Cc1cccc(c1)-c1c(cc2C(=O)NC[C@H](CCN)n12)-c1cccc(OC(F)(F)F)c1
Show InChI InChI=1S/C23H22F3N3O2/c1-14-4-2-6-16(10-14)21-19(15-5-3-7-18(11-15)31-23(24,25)26)12-20-22(30)28-13-17(8-9-27)29(20)21/h2-7,10-12,17H,8-9,13,27H2,1H3,(H,28,30)/t17-/m0/s1
US Patent
n/an/a 15n/an/an/an/a7.5n/a
NERVIANO MEDICAL SCIENCES S.R.L.
US Patent
Assay Description
The inhibitory activity of putative kinase inhibitors and the potency of selected compounds were determined using a trans-phosphorylation assay.Speci...
US Patent US9181258 (2015)
BindingDB Entry DOI: 10.7270/Q2862F7F
Serine/threonine-protein kinase pim-1
(Homo sapiens (Human))
BDBM191078
(US9181258, 92)
Show SMILES Cc1cccc(c1)-c1c(cc2C(=O)NC[C@H](CCN)n12)-c1cccc(OC(F)(F)F)c1
Show InChI InChI=1S/C23H22F3N3O2/c1-14-4-2-6-16(10-14)21-19(15-5-3-7-18(11-15)31-23(24,25)26)12-20-22(30)28-13-17(8-9-27)29(20)21/h2-7,10-12,17H,8-9,13,27H2,1H3,(H,28,30)/t17-/m0/s1
US Patent
n/an/a 5n/an/an/an/a7.5n/a
NERVIANO MEDICAL SCIENCES S.R.L.
US Patent
Assay Description
The inhibitory activity of putative kinase inhibitors and the potency of selected compounds were determined using a trans-phosphorylation assay. Spec...
US Patent US9181258 (2015)
BindingDB Entry DOI: 10.7270/Q2862F7F