BDBM191091 US9181258, 78
SMILES: CN(C)CCNC(=O)c1ccc(cc1)-c1c(cc2C(=O)NCC(CCO)n12)-c1cccc(OC(F)(F)F)c1
InChI Key: InChIKey=DADGQFMQIHDYTQ-UHFFFAOYSA-N
Data: 2 IC50
Activity Spreadsheet -- Enzyme Inhibition Constant Data from BindingDB
Found 2 hits for monomerid = 191091
Trg + Lig
Ki
nM
ΔG°
kcal/mole
IC50
nM
Kd
nM
EC50/IC50
nM
koff
s-1
kon
M-1s-1
pHTemp
°C
Serine/threonine-protein kinase pim-2
(Homo sapiens (Human))
BDBM191091
(US9181258, 78)
Show SMILES CN(C)CCNC(=O)c1ccc(cc1)-c1c(cc2C(=O)NCC(CCO)n12)-c1cccc(OC(F)(F)F)c1
Show InChI InChI=1S/C27H29F3N4O4/c1-33(2)12-11-31-25(36)18-8-6-17(7-9-18)24-22(19-4-3-5-21(14-19)38-27(28,29)30)15-23-26(37)32-16-20(10-13-35)34(23)24/h3-9,14-15,20,35H,10-13,16H2,1-2H3,(H,31,36)(H,32,37)
US Patent
n/an/a 90n/an/an/an/a7.5n/a
NERVIANO MEDICAL SCIENCES S.R.L.
US Patent
Assay Description
The inhibitory activity of putative kinase inhibitors and the potency of selected compounds were determined using a trans-phosphorylation assay.Speci...
US Patent US9181258 (2015)
BindingDB Entry DOI: 10.7270/Q2862F7F
Serine/threonine-protein kinase pim-1
(Homo sapiens (Human))
BDBM191091
(US9181258, 78)
Show SMILES CN(C)CCNC(=O)c1ccc(cc1)-c1c(cc2C(=O)NCC(CCO)n12)-c1cccc(OC(F)(F)F)c1
Show InChI InChI=1S/C27H29F3N4O4/c1-33(2)12-11-31-25(36)18-8-6-17(7-9-18)24-22(19-4-3-5-21(14-19)38-27(28,29)30)15-23-26(37)32-16-20(10-13-35)34(23)24/h3-9,14-15,20,35H,10-13,16H2,1-2H3,(H,31,36)(H,32,37)
US Patent
n/an/a 6n/an/an/an/a7.5n/a
NERVIANO MEDICAL SCIENCES S.R.L.
US Patent
Assay Description
The inhibitory activity of putative kinase inhibitors and the potency of selected compounds were determined using a trans-phosphorylation assay. Spec...
US Patent US9181258 (2015)
BindingDB Entry DOI: 10.7270/Q2862F7F