BDBM191126 US9181258, 121
SMILES: NCC[C@H]1CNC(=O)c2cc(c(-c3cccc(F)c3)n12)-c1cccc(OC(F)(F)F)c1
InChI Key: InChIKey=OMJQNHQCUDWRDZ-INIZCTEOSA-N
Data: 2 IC50
Activity Spreadsheet -- Enzyme Inhibition Constant Data from BindingDB
Found 2 hits for monomerid = 191126
Trg + Lig
Ki
nM
ΔG°
kcal/mole
IC50
nM
Kd
nM
EC50/IC50
nM
koff
s-1
kon
M-1s-1
pHTemp
°C
Serine/threonine-protein kinase pim-2
(Homo sapiens (Human))
BDBM191126
(US9181258, 121)
Show SMILES NCC[C@H]1CNC(=O)c2cc(c(-c3cccc(F)c3)n12)-c1cccc(OC(F)(F)F)c1
Show InChI InChI=1S/C22H19F4N3O2/c23-15-5-1-4-14(9-15)20-18(13-3-2-6-17(10-13)31-22(24,25)26)11-19-21(30)28-12-16(7-8-27)29(19)20/h1-6,9-11,16H,7-8,12,27H2,(H,28,30)/t16-/m0/s1
US Patent
n/an/a 12n/an/an/an/a7.5n/a
NERVIANO MEDICAL SCIENCES S.R.L.
US Patent
Assay Description
The inhibitory activity of putative kinase inhibitors and the potency of selected compounds were determined using a trans-phosphorylation assay.Speci...
US Patent US9181258 (2015)
BindingDB Entry DOI: 10.7270/Q2862F7F
Serine/threonine-protein kinase pim-1
(Homo sapiens (Human))
BDBM191126
(US9181258, 121)
Show SMILES NCC[C@H]1CNC(=O)c2cc(c(-c3cccc(F)c3)n12)-c1cccc(OC(F)(F)F)c1
Show InChI InChI=1S/C22H19F4N3O2/c23-15-5-1-4-14(9-15)20-18(13-3-2-6-17(10-13)31-22(24,25)26)11-19-21(30)28-12-16(7-8-27)29(19)20/h1-6,9-11,16H,7-8,12,27H2,(H,28,30)/t16-/m0/s1
US Patent
n/an/a 3n/an/an/an/a7.5n/a
NERVIANO MEDICAL SCIENCES S.R.L.
US Patent
Assay Description
The inhibitory activity of putative kinase inhibitors and the potency of selected compounds were determined using a trans-phosphorylation assay. Spec...
US Patent US9181258 (2015)
BindingDB Entry DOI: 10.7270/Q2862F7F