BDBM19137 tert-butyl N-[(1S)-1-(tert-butylcarbamoyl)-6-sulfanylhexyl]carbamate::thiolate analogue, 19a
SMILES: CC(C)(C)NC(=O)[C@H](CCCCCS)NC(=O)OC(C)(C)C
InChI Key: InChIKey=FYJYSSQDWGZNHS-LBPRGKRZSA-N
Data: 3 IC50
Activity Spreadsheet -- Enzyme Inhibition Constant Data from BindingDB
Found 3 hits for monomerid = 19137
Trg + Lig
Ki
nM
ΔG°
kcal/mole
IC50
nM
Kd
nM
EC50/IC50
nM
koff
s-1
kon
M-1s-1
pHTemp
°C
Histone Deacetylase 6 (HDAC6)
(Mus musculus)
BDBM19137
(tert-butyl N-[(1S)-1-(tert-butylcarbamoyl)-6-sulfa...)
Show SMILES CC(C)(C)NC(=O)[C@H](CCCCCS)NC(=O)OC(C)(C)C |r|
Show InChI InChI=1S/C16H32N2O3S/c1-15(2,3)18-13(19)12(10-8-7-9-11-22)17-14(20)21-16(4,5)6/h12,22H,7-11H2,1-6H3,(H,17,20)(H,18,19)/t12-/m0/s1
Reactome pathway
n/an/a 71n/an/an/an/a8.037
Nagoya City University
Assay Description
The enzyme activity was assayed using recombinant HDAC and [3H] acetyl-labeled histones as substrate. The released [3H]acetic acid was extracted and ...
J Med Chem 50: 5425-38 (2007)
Article DOI: 10.1021/jm7009217
BindingDB Entry DOI: 10.7270/Q2XK8CT6
Histone deacetylase 4
(Homo sapiens (Human))
BDBM19137
(tert-butyl N-[(1S)-1-(tert-butylcarbamoyl)-6-sulfa...)
Show SMILES CC(C)(C)NC(=O)[C@H](CCCCCS)NC(=O)OC(C)(C)C |r|
Show InChI InChI=1S/C16H32N2O3S/c1-15(2,3)18-13(19)12(10-8-7-9-11-22)17-14(20)21-16(4,5)6/h12,22H,7-11H2,1-6H3,(H,17,20)(H,18,19)/t12-/m0/s1
n/an/a 1.90E+3n/an/an/an/an/an/a
Nagoya City University
Assay Description
The enzyme activity was assayed using recombinant HDAC and [3H] acetyl-labeled histones as substrate. The released [3H]acetic acid was extracted and ...
J Med Chem 50: 5425-38 (2007)
Article DOI: 10.1021/jm7009217
BindingDB Entry DOI: 10.7270/Q2XK8CT6
Histone deacetylase 1
(Homo sapiens (Human))
BDBM19137
(tert-butyl N-[(1S)-1-(tert-butylcarbamoyl)-6-sulfa...)
Show SMILES CC(C)(C)NC(=O)[C@H](CCCCCS)NC(=O)OC(C)(C)C |r|
Show InChI InChI=1S/C16H32N2O3S/c1-15(2,3)18-13(19)12(10-8-7-9-11-22)17-14(20)21-16(4,5)6/h12,22H,7-11H2,1-6H3,(H,17,20)(H,18,19)/t12-/m0/s1
NCI pathway
Reactome pathway
n/an/a 3.00E+3n/an/an/an/a8.037
Nagoya City University
Assay Description
The enzyme activity was assayed using recombinant HDAC and [3H] acetyl-labeled histones as substrate. The released [3H]acetic acid was extracted and ...
J Med Chem 50: 5425-38 (2007)
Article DOI: 10.1021/jm7009217
BindingDB Entry DOI: 10.7270/Q2XK8CT6