null
SMILES: Nc1ncnc2n(nc(-c3ccc(Oc4ccccc4)cc3)c12)[C@@H]1CC[C@@H](CC1)NC(=O)\C=C\CN1CCOCC1
InChI Key: InChIKey=QWEKIGQOBHAQDZ-WWBGYUKBSA-N
Activity Spreadsheet -- Enzyme Inhibition Constant Data from BindingDB
Found 10 hits for monomerid = 191629
Trg + Lig
Ki
nM
ΔG°
kcal/mole
IC50
nM
Kd
nM
EC50/IC50
nM
koff
s-1
kon
M-1s-1
pHTemp
°C
Tyrosine-protein kinase BTK
(Homo sapiens (Human))
BDBM191629
(US9181263, 25 | US9278100, 25)
Show SMILES Nc1ncnc2n(nc(-c3ccc(Oc4ccccc4)cc3)c12)[C@@H]1CC[C@@H](CC1)NC(=O)\C=C\CN1CCOCC1 |r,wU:23.26,26.33,(-9.32,6.4,;-8.92,4.92,;-10.01,3.83,;-9.61,2.34,;-8.12,1.94,;-7.03,3.03,;-5.49,2.95,;-4.94,4.39,;-6.14,5.36,;-6.14,6.9,;-4.8,7.67,;-4.8,9.21,;-6.14,9.98,;-6.14,11.52,;-4.8,12.29,;-3.47,11.52,;-2.14,12.29,;-2.14,13.83,;-3.47,14.6,;-4.8,13.83,;-7.47,9.21,;-7.47,7.67,;-7.43,4.52,;-4.72,1.62,;-5.49,.28,;-4.72,-1.05,;-3.18,-1.05,;-2.41,.28,;-3.18,1.62,;-2.41,-2.39,;-.87,-2.39,;-.1,-3.72,;-.1,-1.05,;1.44,-1.05,;2.21,.28,;3.75,.28,;4.52,1.62,;6.06,1.62,;6.83,.28,;6.06,-1.05,;4.52,-1.05,)|
Show InChI InChI=1S/C31H35N7O3/c32-30-28-29(22-8-14-26(15-9-22)41-25-5-2-1-3-6-25)36-38(31(28)34-21-33-30)24-12-10-23(11-13-24)35-27(39)7-4-16-37-17-19-40-20-18-37/h1-9,14-15,21,23-24H,10-13,16-20H2,(H,35,39)(H2,32,33,34)/b7-4+/t23-,24+
NCI pathway
Reactome pathway
US Patent
n/an/a 3.48n/an/an/an/an/an/a
PHARMACYCLICS LLC
US Patent
Assay Description
IC50s were determined using the in vitro HotSpot kinase assay (purified enzymes, 33P-ATP, an appropriate substrate and 1 μM ATP.). For enzyme in...
US Patent US9181263 (2015)
BindingDB Entry DOI: 10.7270/Q2765D5Z
Tyrosine-protein kinase ITK/TSK
(Homo sapiens (Human))
BDBM191629
(US9181263, 25 | US9278100, 25)
Show SMILES Nc1ncnc2n(nc(-c3ccc(Oc4ccccc4)cc3)c12)[C@@H]1CC[C@@H](CC1)NC(=O)\C=C\CN1CCOCC1 |r,wU:23.26,26.33,(-9.32,6.4,;-8.92,4.92,;-10.01,3.83,;-9.61,2.34,;-8.12,1.94,;-7.03,3.03,;-5.49,2.95,;-4.94,4.39,;-6.14,5.36,;-6.14,6.9,;-4.8,7.67,;-4.8,9.21,;-6.14,9.98,;-6.14,11.52,;-4.8,12.29,;-3.47,11.52,;-2.14,12.29,;-2.14,13.83,;-3.47,14.6,;-4.8,13.83,;-7.47,9.21,;-7.47,7.67,;-7.43,4.52,;-4.72,1.62,;-5.49,.28,;-4.72,-1.05,;-3.18,-1.05,;-2.41,.28,;-3.18,1.62,;-2.41,-2.39,;-.87,-2.39,;-.1,-3.72,;-.1,-1.05,;1.44,-1.05,;2.21,.28,;3.75,.28,;4.52,1.62,;6.06,1.62,;6.83,.28,;6.06,-1.05,;4.52,-1.05,)|
Show InChI InChI=1S/C31H35N7O3/c32-30-28-29(22-8-14-26(15-9-22)41-25-5-2-1-3-6-25)36-38(31(28)34-21-33-30)24-12-10-23(11-13-24)35-27(39)7-4-16-37-17-19-40-20-18-37/h1-9,14-15,21,23-24H,10-13,16-20H2,(H,35,39)(H2,32,33,34)/b7-4+/t23-,24+
Reactome pathway
US Patent
n/an/a>1.00E+4n/an/an/an/an/an/a
PHARMACYCLICS LLC
US Patent
Assay Description
IC50s were determined using the in vitro HotSpot kinase assay (purified enzymes, 33P-ATP, an appropriate substrate and 1 μM ATP.). For enzyme in...
US Patent US9181263 (2015)
BindingDB Entry DOI: 10.7270/Q2765D5Z
Epidermal growth factor receptor
(Homo sapiens (Human))
BDBM191629
(US9181263, 25 | US9278100, 25)
Show SMILES Nc1ncnc2n(nc(-c3ccc(Oc4ccccc4)cc3)c12)[C@@H]1CC[C@@H](CC1)NC(=O)\C=C\CN1CCOCC1 |r,wU:23.26,26.33,(-9.32,6.4,;-8.92,4.92,;-10.01,3.83,;-9.61,2.34,;-8.12,1.94,;-7.03,3.03,;-5.49,2.95,;-4.94,4.39,;-6.14,5.36,;-6.14,6.9,;-4.8,7.67,;-4.8,9.21,;-6.14,9.98,;-6.14,11.52,;-4.8,12.29,;-3.47,11.52,;-2.14,12.29,;-2.14,13.83,;-3.47,14.6,;-4.8,13.83,;-7.47,9.21,;-7.47,7.67,;-7.43,4.52,;-4.72,1.62,;-5.49,.28,;-4.72,-1.05,;-3.18,-1.05,;-2.41,.28,;-3.18,1.62,;-2.41,-2.39,;-.87,-2.39,;-.1,-3.72,;-.1,-1.05,;1.44,-1.05,;2.21,.28,;3.75,.28,;4.52,1.62,;6.06,1.62,;6.83,.28,;6.06,-1.05,;4.52,-1.05,)|
Show InChI InChI=1S/C31H35N7O3/c32-30-28-29(22-8-14-26(15-9-22)41-25-5-2-1-3-6-25)36-38(31(28)34-21-33-30)24-12-10-23(11-13-24)35-27(39)7-4-16-37-17-19-40-20-18-37/h1-9,14-15,21,23-24H,10-13,16-20H2,(H,35,39)(H2,32,33,34)/b7-4+/t23-,24+
US Patent
n/an/a 273n/an/an/an/an/an/a
PHARMACYCLICS LLC
US Patent
Assay Description
IC50s were determined using the in vitro HotSpot kinase assay (purified enzymes, 33P-ATP, an appropriate substrate and 1 μM ATP.). For enzyme in...
US Patent US9181263 (2015)
BindingDB Entry DOI: 10.7270/Q2765D5Z
Tyrosine-protein kinase Lck
(Homo sapiens (Human))
BDBM191629
(US9181263, 25 | US9278100, 25)
Show SMILES Nc1ncnc2n(nc(-c3ccc(Oc4ccccc4)cc3)c12)[C@@H]1CC[C@@H](CC1)NC(=O)\C=C\CN1CCOCC1 |r,wU:23.26,26.33,(-9.32,6.4,;-8.92,4.92,;-10.01,3.83,;-9.61,2.34,;-8.12,1.94,;-7.03,3.03,;-5.49,2.95,;-4.94,4.39,;-6.14,5.36,;-6.14,6.9,;-4.8,7.67,;-4.8,9.21,;-6.14,9.98,;-6.14,11.52,;-4.8,12.29,;-3.47,11.52,;-2.14,12.29,;-2.14,13.83,;-3.47,14.6,;-4.8,13.83,;-7.47,9.21,;-7.47,7.67,;-7.43,4.52,;-4.72,1.62,;-5.49,.28,;-4.72,-1.05,;-3.18,-1.05,;-2.41,.28,;-3.18,1.62,;-2.41,-2.39,;-.87,-2.39,;-.1,-3.72,;-.1,-1.05,;1.44,-1.05,;2.21,.28,;3.75,.28,;4.52,1.62,;6.06,1.62,;6.83,.28,;6.06,-1.05,;4.52,-1.05,)|
Show InChI InChI=1S/C31H35N7O3/c32-30-28-29(22-8-14-26(15-9-22)41-25-5-2-1-3-6-25)36-38(31(28)34-21-33-30)24-12-10-23(11-13-24)35-27(39)7-4-16-37-17-19-40-20-18-37/h1-9,14-15,21,23-24H,10-13,16-20H2,(H,35,39)(H2,32,33,34)/b7-4+/t23-,24+
US Patent
n/an/a 25.8n/an/an/an/an/an/a
PHARMACYCLICS LLC
US Patent
Assay Description
IC50s were determined using the in vitro HotSpot kinase assay (purified enzymes, 33P-ATP, an appropriate substrate and 1 μM ATP.). For enzyme in...
US Patent US9181263 (2015)
BindingDB Entry DOI: 10.7270/Q2765D5Z
Tyrosine-protein kinase JAK3
(Homo sapiens (Human))
BDBM191629
(US9181263, 25 | US9278100, 25)
Show SMILES Nc1ncnc2n(nc(-c3ccc(Oc4ccccc4)cc3)c12)[C@@H]1CC[C@@H](CC1)NC(=O)\C=C\CN1CCOCC1 |r,wU:23.26,26.33,(-9.32,6.4,;-8.92,4.92,;-10.01,3.83,;-9.61,2.34,;-8.12,1.94,;-7.03,3.03,;-5.49,2.95,;-4.94,4.39,;-6.14,5.36,;-6.14,6.9,;-4.8,7.67,;-4.8,9.21,;-6.14,9.98,;-6.14,11.52,;-4.8,12.29,;-3.47,11.52,;-2.14,12.29,;-2.14,13.83,;-3.47,14.6,;-4.8,13.83,;-7.47,9.21,;-7.47,7.67,;-7.43,4.52,;-4.72,1.62,;-5.49,.28,;-4.72,-1.05,;-3.18,-1.05,;-2.41,.28,;-3.18,1.62,;-2.41,-2.39,;-.87,-2.39,;-.1,-3.72,;-.1,-1.05,;1.44,-1.05,;2.21,.28,;3.75,.28,;4.52,1.62,;6.06,1.62,;6.83,.28,;6.06,-1.05,;4.52,-1.05,)|
Show InChI InChI=1S/C31H35N7O3/c32-30-28-29(22-8-14-26(15-9-22)41-25-5-2-1-3-6-25)36-38(31(28)34-21-33-30)24-12-10-23(11-13-24)35-27(39)7-4-16-37-17-19-40-20-18-37/h1-9,14-15,21,23-24H,10-13,16-20H2,(H,35,39)(H2,32,33,34)/b7-4+/t23-,24+
Reactome pathway
US Patent
n/an/a>1.00E+4n/an/an/an/an/an/a
Pharmacyclics LLC
US Patent
Assay Description
IC50s were determined using the in vitro HotSpot kinase assay (purified enzymes, 33P-ATP, an appropriate substrate and 1 uM ATP.). Reaction condition...
US Patent US9278100 (2016)
BindingDB Entry DOI: 10.7270/Q20C4TMX
Tyrosine-protein kinase BTK
(Homo sapiens (Human))
BDBM191629
(US9181263, 25 | US9278100, 25)
Show SMILES Nc1ncnc2n(nc(-c3ccc(Oc4ccccc4)cc3)c12)[C@@H]1CC[C@@H](CC1)NC(=O)\C=C\CN1CCOCC1 |r,wU:23.26,26.33,(-9.32,6.4,;-8.92,4.92,;-10.01,3.83,;-9.61,2.34,;-8.12,1.94,;-7.03,3.03,;-5.49,2.95,;-4.94,4.39,;-6.14,5.36,;-6.14,6.9,;-4.8,7.67,;-4.8,9.21,;-6.14,9.98,;-6.14,11.52,;-4.8,12.29,;-3.47,11.52,;-2.14,12.29,;-2.14,13.83,;-3.47,14.6,;-4.8,13.83,;-7.47,9.21,;-7.47,7.67,;-7.43,4.52,;-4.72,1.62,;-5.49,.28,;-4.72,-1.05,;-3.18,-1.05,;-2.41,.28,;-3.18,1.62,;-2.41,-2.39,;-.87,-2.39,;-.1,-3.72,;-.1,-1.05,;1.44,-1.05,;2.21,.28,;3.75,.28,;4.52,1.62,;6.06,1.62,;6.83,.28,;6.06,-1.05,;4.52,-1.05,)|
Show InChI InChI=1S/C31H35N7O3/c32-30-28-29(22-8-14-26(15-9-22)41-25-5-2-1-3-6-25)36-38(31(28)34-21-33-30)24-12-10-23(11-13-24)35-27(39)7-4-16-37-17-19-40-20-18-37/h1-9,14-15,21,23-24H,10-13,16-20H2,(H,35,39)(H2,32,33,34)/b7-4+/t23-,24+
NCI pathway
Reactome pathway
US Patent
n/an/a 3.48n/an/an/an/an/an/a
Pharmacyclics LLC
US Patent
Assay Description
IC50s were determined using the in vitro HotSpot kinase assay (purified enzymes, 33P-ATP, an appropriate substrate and 1 uM ATP.). Reaction condition...
US Patent US9278100 (2016)
BindingDB Entry DOI: 10.7270/Q20C4TMX
Tyrosine-protein kinase ITK/TSK
(Homo sapiens (Human))
BDBM191629
(US9181263, 25 | US9278100, 25)
Show SMILES Nc1ncnc2n(nc(-c3ccc(Oc4ccccc4)cc3)c12)[C@@H]1CC[C@@H](CC1)NC(=O)\C=C\CN1CCOCC1 |r,wU:23.26,26.33,(-9.32,6.4,;-8.92,4.92,;-10.01,3.83,;-9.61,2.34,;-8.12,1.94,;-7.03,3.03,;-5.49,2.95,;-4.94,4.39,;-6.14,5.36,;-6.14,6.9,;-4.8,7.67,;-4.8,9.21,;-6.14,9.98,;-6.14,11.52,;-4.8,12.29,;-3.47,11.52,;-2.14,12.29,;-2.14,13.83,;-3.47,14.6,;-4.8,13.83,;-7.47,9.21,;-7.47,7.67,;-7.43,4.52,;-4.72,1.62,;-5.49,.28,;-4.72,-1.05,;-3.18,-1.05,;-2.41,.28,;-3.18,1.62,;-2.41,-2.39,;-.87,-2.39,;-.1,-3.72,;-.1,-1.05,;1.44,-1.05,;2.21,.28,;3.75,.28,;4.52,1.62,;6.06,1.62,;6.83,.28,;6.06,-1.05,;4.52,-1.05,)|
Show InChI InChI=1S/C31H35N7O3/c32-30-28-29(22-8-14-26(15-9-22)41-25-5-2-1-3-6-25)36-38(31(28)34-21-33-30)24-12-10-23(11-13-24)35-27(39)7-4-16-37-17-19-40-20-18-37/h1-9,14-15,21,23-24H,10-13,16-20H2,(H,35,39)(H2,32,33,34)/b7-4+/t23-,24+
Reactome pathway
US Patent
n/an/a>1.00E+4n/an/an/an/an/an/a
Pharmacyclics LLC
US Patent
Assay Description
IC50s were determined using the in vitro HotSpot kinase assay (purified enzymes, 33P-ATP, an appropriate substrate and 1 uM ATP.). Reaction condition...
US Patent US9278100 (2016)
BindingDB Entry DOI: 10.7270/Q20C4TMX
Epidermal growth factor receptor
(Homo sapiens (Human))
BDBM191629
(US9181263, 25 | US9278100, 25)
Show SMILES Nc1ncnc2n(nc(-c3ccc(Oc4ccccc4)cc3)c12)[C@@H]1CC[C@@H](CC1)NC(=O)\C=C\CN1CCOCC1 |r,wU:23.26,26.33,(-9.32,6.4,;-8.92,4.92,;-10.01,3.83,;-9.61,2.34,;-8.12,1.94,;-7.03,3.03,;-5.49,2.95,;-4.94,4.39,;-6.14,5.36,;-6.14,6.9,;-4.8,7.67,;-4.8,9.21,;-6.14,9.98,;-6.14,11.52,;-4.8,12.29,;-3.47,11.52,;-2.14,12.29,;-2.14,13.83,;-3.47,14.6,;-4.8,13.83,;-7.47,9.21,;-7.47,7.67,;-7.43,4.52,;-4.72,1.62,;-5.49,.28,;-4.72,-1.05,;-3.18,-1.05,;-2.41,.28,;-3.18,1.62,;-2.41,-2.39,;-.87,-2.39,;-.1,-3.72,;-.1,-1.05,;1.44,-1.05,;2.21,.28,;3.75,.28,;4.52,1.62,;6.06,1.62,;6.83,.28,;6.06,-1.05,;4.52,-1.05,)|
Show InChI InChI=1S/C31H35N7O3/c32-30-28-29(22-8-14-26(15-9-22)41-25-5-2-1-3-6-25)36-38(31(28)34-21-33-30)24-12-10-23(11-13-24)35-27(39)7-4-16-37-17-19-40-20-18-37/h1-9,14-15,21,23-24H,10-13,16-20H2,(H,35,39)(H2,32,33,34)/b7-4+/t23-,24+
US Patent
n/an/a 273n/an/an/an/an/an/a
Pharmacyclics LLC
US Patent
Assay Description
IC50s were determined using the in vitro HotSpot kinase assay (purified enzymes, 33P-ATP, an appropriate substrate and 1 uM ATP.). Reaction condition...
US Patent US9278100 (2016)
BindingDB Entry DOI: 10.7270/Q20C4TMX
Tyrosine-protein kinase Lck
(Homo sapiens (Human))
BDBM191629
(US9181263, 25 | US9278100, 25)
Show SMILES Nc1ncnc2n(nc(-c3ccc(Oc4ccccc4)cc3)c12)[C@@H]1CC[C@@H](CC1)NC(=O)\C=C\CN1CCOCC1 |r,wU:23.26,26.33,(-9.32,6.4,;-8.92,4.92,;-10.01,3.83,;-9.61,2.34,;-8.12,1.94,;-7.03,3.03,;-5.49,2.95,;-4.94,4.39,;-6.14,5.36,;-6.14,6.9,;-4.8,7.67,;-4.8,9.21,;-6.14,9.98,;-6.14,11.52,;-4.8,12.29,;-3.47,11.52,;-2.14,12.29,;-2.14,13.83,;-3.47,14.6,;-4.8,13.83,;-7.47,9.21,;-7.47,7.67,;-7.43,4.52,;-4.72,1.62,;-5.49,.28,;-4.72,-1.05,;-3.18,-1.05,;-2.41,.28,;-3.18,1.62,;-2.41,-2.39,;-.87,-2.39,;-.1,-3.72,;-.1,-1.05,;1.44,-1.05,;2.21,.28,;3.75,.28,;4.52,1.62,;6.06,1.62,;6.83,.28,;6.06,-1.05,;4.52,-1.05,)|
Show InChI InChI=1S/C31H35N7O3/c32-30-28-29(22-8-14-26(15-9-22)41-25-5-2-1-3-6-25)36-38(31(28)34-21-33-30)24-12-10-23(11-13-24)35-27(39)7-4-16-37-17-19-40-20-18-37/h1-9,14-15,21,23-24H,10-13,16-20H2,(H,35,39)(H2,32,33,34)/b7-4+/t23-,24+
US Patent
n/an/a 25.8n/an/an/an/an/an/a
Pharmacyclics LLC
US Patent
Assay Description
IC50s were determined using the in vitro HotSpot kinase assay (purified enzymes, 33P-ATP, an appropriate substrate and 1 uM ATP.). Reaction condition...
US Patent US9278100 (2016)
BindingDB Entry DOI: 10.7270/Q20C4TMX
Tyrosine-protein kinase JAK3
(Homo sapiens (Human))
BDBM191629
(US9181263, 25 | US9278100, 25)
Show SMILES Nc1ncnc2n(nc(-c3ccc(Oc4ccccc4)cc3)c12)[C@@H]1CC[C@@H](CC1)NC(=O)\C=C\CN1CCOCC1 |r,wU:23.26,26.33,(-9.32,6.4,;-8.92,4.92,;-10.01,3.83,;-9.61,2.34,;-8.12,1.94,;-7.03,3.03,;-5.49,2.95,;-4.94,4.39,;-6.14,5.36,;-6.14,6.9,;-4.8,7.67,;-4.8,9.21,;-6.14,9.98,;-6.14,11.52,;-4.8,12.29,;-3.47,11.52,;-2.14,12.29,;-2.14,13.83,;-3.47,14.6,;-4.8,13.83,;-7.47,9.21,;-7.47,7.67,;-7.43,4.52,;-4.72,1.62,;-5.49,.28,;-4.72,-1.05,;-3.18,-1.05,;-2.41,.28,;-3.18,1.62,;-2.41,-2.39,;-.87,-2.39,;-.1,-3.72,;-.1,-1.05,;1.44,-1.05,;2.21,.28,;3.75,.28,;4.52,1.62,;6.06,1.62,;6.83,.28,;6.06,-1.05,;4.52,-1.05,)|
Show InChI InChI=1S/C31H35N7O3/c32-30-28-29(22-8-14-26(15-9-22)41-25-5-2-1-3-6-25)36-38(31(28)34-21-33-30)24-12-10-23(11-13-24)35-27(39)7-4-16-37-17-19-40-20-18-37/h1-9,14-15,21,23-24H,10-13,16-20H2,(H,35,39)(H2,32,33,34)/b7-4+/t23-,24+
Reactome pathway
US Patent
n/an/a>1.00E+4n/an/an/an/an/an/a
PHARMACYCLICS LLC
US Patent
Assay Description
IC50s were determined using the in vitro HotSpot kinase assay (purified enzymes, 33P-ATP, an appropriate substrate and 1 μM ATP.). For enzyme in...
US Patent US9181263 (2015)
BindingDB Entry DOI: 10.7270/Q2765D5Z