BDBM191632 US9182402, 2
SMILES: Cc1ccc(OCc2nnc(NC(=O)Nc3cccc(Cl)c3)s2)cc1C
InChI Key: InChIKey=PKUMGHOUAGUDQS-UHFFFAOYSA-N
Data: 3 IC50
Activity Spreadsheet -- Enzyme Inhibition Constant Data from BindingDB
Found 3 hits for monomerid = 191632
Trg + Lig
Ki
nM
ΔG°
kcal/mole
IC50
nM
Kd
nM
EC50/IC50
nM
koff
s-1
kon
M-1s-1
pHTemp
°C
Hepsin
(Homo sapiens (Human))
BDBM191632
(US9182402, 2)
Show SMILES Cc1ccc(OCc2nnc(NC(=O)Nc3cccc(Cl)c3)s2)cc1C
Show InChI InChI=1S/C18H17ClN4O2S/c1-11-6-7-15(8-12(11)2)25-10-16-22-23-18(26-16)21-17(24)20-14-5-3-4-13(19)9-14/h3-9H,10H2,1-2H3,(H2,20,21,23,24)
US Patent
n/an/a 760n/an/an/an/an/an/a
Fred Hutchinson Cancer Research Center
US Patent
Assay Description
To identify novel inhibitors of hepsin, the Chembridge DIVERSet 10,000 compound high-diversity library was screened using an assay based on the cleav...
US Patent US9182402 (2015)
BindingDB Entry DOI: 10.7270/Q23F4NF7
Thrombin
(Bos taurus (Bovine))
BDBM191632
(US9182402, 2)
Show SMILES Cc1ccc(OCc2nnc(NC(=O)Nc3cccc(Cl)c3)s2)cc1C
Show InChI InChI=1S/C18H17ClN4O2S/c1-11-6-7-15(8-12(11)2)25-10-16-22-23-18(26-16)21-17(24)20-14-5-3-4-13(19)9-14/h3-9H,10H2,1-2H3,(H2,20,21,23,24)
US Patent
n/an/a>2.00E+4n/an/an/an/an/an/a
Fred Hutchinson Cancer Research Center
US Patent
Assay Description
To identify novel inhibitors of hepsin, the Chembridge DIVERSet 10,000 compound high-diversity library was screened using an assay based on the cleav...
US Patent US9182402 (2015)
BindingDB Entry DOI: 10.7270/Q23F4NF7
Trypsin
(Sus scrofa)
BDBM191632
(US9182402, 2)
Show SMILES Cc1ccc(OCc2nnc(NC(=O)Nc3cccc(Cl)c3)s2)cc1C
Show InChI InChI=1S/C18H17ClN4O2S/c1-11-6-7-15(8-12(11)2)25-10-16-22-23-18(26-16)21-17(24)20-14-5-3-4-13(19)9-14/h3-9H,10H2,1-2H3,(H2,20,21,23,24)
US Patent
n/an/a>2.00E+4n/an/an/an/an/an/a
Fred Hutchinson Cancer Research Center
US Patent
Assay Description
To identify novel inhibitors of hepsin, the Chembridge DIVERSet 10,000 compound high-diversity library was screened using an assay based on the cleav...
US Patent US9182402 (2015)
BindingDB Entry DOI: 10.7270/Q23F4NF7