BDBM192017 Inz-8
SMILES: COC(=O)Cn1nc(-c2cccc(OCCc3ccccc3)c2)c2ccccc12
InChI Key: InChIKey=IXPOLSDVZYEJFR-UHFFFAOYSA-N
Data: 2 IC50
Activity Spreadsheet -- Enzyme Inhibition Constant Data from BindingDB
Found 2 hits for monomerid = 192017
Trg + Lig
Ki
nM
ΔG°
kcal/mole
IC50
nM
Kd
nM
EC50/IC50
nM
koff
s-1
kon
M-1s-1
pHTemp
°C
Cytochrome b
(Candida albicans (Yeast))
BDBM192017
(Inz-8)
Show SMILES COC(=O)Cn1nc(-c2cccc(OCCc3ccccc3)c2)c2ccccc12
Show InChI InChI=1S/C24H22N2O3/c1-28-23(27)17-26-22-13-6-5-12-21(22)24(25-26)19-10-7-11-20(16-19)29-15-14-18-8-3-2-4-9-18/h2-13,16H,14-15,17H2,1H3
n/an/a 346n/an/an/an/a7.425
Massachusetts Institute of Technology
Assay Description
The cytochrome b enzyme assay was adapted from previous studies (Gutierrez-Cirlos et al., 2004). Briefly, compounds were diluted in a 23 reaction buf...
Cell Chem Biol 23: 978-991 (2016)
Article DOI: 10.1016/j.chembiol.2016.06.016
BindingDB Entry DOI: 10.7270/Q2SX6C1B
Cytochrome b
(Homo sapiens (Human))
BDBM192017
(Inz-8)
Show SMILES COC(=O)Cn1nc(-c2cccc(OCCc3ccccc3)c2)c2ccccc12
Show InChI InChI=1S/C24H22N2O3/c1-28-23(27)17-26-22-13-6-5-12-21(22)24(25-26)19-10-7-11-20(16-19)29-15-14-18-8-3-2-4-9-18/h2-13,16H,14-15,17H2,1H3
n/an/a 1.39E+4n/an/an/an/a7.425
Massachusetts Institute of Technology
Assay Description
The cytochrome b enzyme assay was adapted from previous studies (Gutierrez-Cirlos et al., 2004). Briefly, compounds were diluted in a 23 reaction buf...
Cell Chem Biol 23: 978-991 (2016)
Article DOI: 10.1016/j.chembiol.2016.06.016
BindingDB Entry DOI: 10.7270/Q2SX6C1B