BDBM19206 (1S)-1-[(4aR,5S)-1-(4-fluorophenyl)-4a-methyl-1H,4H,4aH,5H,6H,7H,8H-cyclohexa[f]indazol-5-yl]but-3-en-1-ol::N-Arylpyrazolo[3,2-c]-Based Ligand, 30
SMILES: [H][C@@]1(CCCC2=Cc3c(C[C@]12C)cnn3-c1ccc(F)cc1)[C@@H](O)CC=C
InChI Key: InChIKey=QELYUNHSBLBUDL-HJNYFJLDSA-N
Data: 1 KI  2 IC50  2 EC50
Activity Spreadsheet -- Enzyme Inhibition Constant Data from BindingDB
Found 4 hits for monomerid = 19206
Trg + Lig
Ki
nM
ΔG°
kcal/mole
IC50
nM
Kd
nM
EC50/IC50
nM
koff
s-1
kon
M-1s-1
pHTemp
°C
Glucocorticoid receptor
(Homo sapiens (Human))
BDBM19206
((1S)-1-[(4aR,5S)-1-(4-fluorophenyl)-4a-methyl-1H,4...)
Show SMILES [H][C@@]1(CCCC2=Cc3c(C[C@]12C)cnn3-c1ccc(F)cc1)[C@@H](O)CC=C |r,t:5|
Show InChI InChI=1S/C22H25FN2O/c1-3-5-21(26)19-7-4-6-16-12-20-15(13-22(16,19)2)14-24-25(20)18-10-8-17(23)9-11-18/h3,8-12,14,19,21,26H,1,4-7,13H2,2H3/t19-,21+,22+/m1/s1
3.90n/an/an/an/an/an/an/an/a
Bristol-Myers Squibb Company
Curated by ChEMBL
Assay Description
Displacement of GS-red from human glucocorticoid receptor by fluorescent polarization assay
J Med Chem 53: 1270-80 (2010)
Article DOI: 10.1021/jm901551w
BindingDB Entry DOI: 10.7270/Q2KS6SGW
Glucocorticoid receptor
(Homo sapiens (Human))
BDBM19206
((1S)-1-[(4aR,5S)-1-(4-fluorophenyl)-4a-methyl-1H,4...)
Show SMILES [H][C@@]1(CCCC2=Cc3c(C[C@]12C)cnn3-c1ccc(F)cc1)[C@@H](O)CC=C |r,t:5|
Show InChI InChI=1S/C22H25FN2O/c1-3-5-21(26)19-7-4-6-16-12-20-15(13-22(16,19)2)14-24-25(20)18-10-8-17(23)9-11-18/h3,8-12,14,19,21,26H,1,4-7,13H2,2H3/t19-,21+,22+/m1/s1
n/an/an/an/a 9.30n/an/an/an/a
Bristol-Myers Squibb Company
Curated by ChEMBL
Assay Description
Transrepression activity at glucocorticoid receptor expressed in human A549 cells assessed as inhibition of PMA-induced AP1 activity after 6 hrs by l...
J Med Chem 53: 1270-80 (2010)
Article DOI: 10.1021/jm901551w
BindingDB Entry DOI: 10.7270/Q2KS6SGW
Glucocorticoid receptor
(Homo sapiens (Human))
BDBM19206
((1S)-1-[(4aR,5S)-1-(4-fluorophenyl)-4a-methyl-1H,4...)
Show SMILES [H][C@@]1(CCCC2=Cc3c(C[C@]12C)cnn3-c1ccc(F)cc1)[C@@H](O)CC=C |r,t:5|
Show InChI InChI=1S/C22H25FN2O/c1-3-5-21(26)19-7-4-6-16-12-20-15(13-22(16,19)2)14-24-25(20)18-10-8-17(23)9-11-18/h3,8-12,14,19,21,26H,1,4-7,13H2,2H3/t19-,21+,22+/m1/s1
n/an/a 3.90n/a 9.30n/an/a7.54
Merck Research Laboratories
Assay Description
The IC50s were determined by incubating the receptors with radiolabeled dexamethasone in the presence of full log scale concentrations (10-11 M to 10...
J Med Chem 47: 2441-52 (2004)
Article DOI: 10.1021/jm030585i
BindingDB Entry DOI: 10.7270/Q28W3BKZ
Androgen Receptor
(Homo sapiens (Human))
BDBM19206
((1S)-1-[(4aR,5S)-1-(4-fluorophenyl)-4a-methyl-1H,4...)
Show SMILES [H][C@@]1(CCCC2=Cc3c(C[C@]12C)cnn3-c1ccc(F)cc1)[C@@H](O)CC=C |r,t:5|
Show InChI InChI=1S/C22H25FN2O/c1-3-5-21(26)19-7-4-6-16-12-20-15(13-22(16,19)2)14-24-25(20)18-10-8-17(23)9-11-18/h3,8-12,14,19,21,26H,1,4-7,13H2,2H3/t19-,21+,22+/m1/s1
NCI pathway
Reactome pathway
n/an/a>4.00E+3n/an/an/an/an/an/a
Bristol-Myers Squibb Company
Curated by ChEMBL
Assay Description
Binding affinity to androgen receptor
J Med Chem 53: 1270-80 (2010)
Article DOI: 10.1021/jm901551w
BindingDB Entry DOI: 10.7270/Q2KS6SGW