BDBM192070 Inz-61
SMILES: COC(=O)Cn1nc(-c2cc(F)ccc2F)c2ccccc12
InChI Key: InChIKey=DOMDMSCFDIJLKR-UHFFFAOYSA-N
Data: 2 IC50
Activity Spreadsheet -- Enzyme Inhibition Constant Data from BindingDB
Found 2 hits for monomerid = 192070
Trg + Lig
Ki
nM
ΔG°
kcal/mole
IC50
nM
Kd
nM
EC50/IC50
nM
koff
s-1
kon
M-1s-1
pHTemp
°C
Cytochrome b
(Candida albicans (Yeast))
BDBM192070
(Inz-61)
Show SMILES COC(=O)Cn1nc(-c2cc(F)ccc2F)c2ccccc12
Show InChI InChI=1S/C16H12F2N2O2/c1-22-15(21)9-20-14-5-3-2-4-11(14)16(19-20)12-8-10(17)6-7-13(12)18/h2-8H,9H2,1H3
n/an/a 891n/an/an/an/a7.425
Massachusetts Institute of Technology
Assay Description
The cytochrome b enzyme assay was adapted from previous studies (Gutierrez-Cirlos et al., 2004). Briefly, compounds were diluted in a 23 reaction buf...
Cell Chem Biol 23: 978-991 (2016)
Article DOI: 10.1016/j.chembiol.2016.06.016
BindingDB Entry DOI: 10.7270/Q2SX6C1B
Cytochrome b
(Homo sapiens (Human))
BDBM192070
(Inz-61)
Show SMILES COC(=O)Cn1nc(-c2cc(F)ccc2F)c2ccccc12
Show InChI InChI=1S/C16H12F2N2O2/c1-22-15(21)9-20-14-5-3-2-4-11(14)16(19-20)12-8-10(17)6-7-13(12)18/h2-8H,9H2,1H3
n/an/a>6.40E+4n/an/an/an/a7.425
Massachusetts Institute of Technology
Assay Description
The cytochrome b enzyme assay was adapted from previous studies (Gutierrez-Cirlos et al., 2004). Briefly, compounds were diluted in a 23 reaction buf...
Cell Chem Biol 23: 978-991 (2016)
Article DOI: 10.1016/j.chembiol.2016.06.016
BindingDB Entry DOI: 10.7270/Q2SX6C1B