null
SMILES: Fc1cc(F)cc(c1)C1(CCc2nc(no2)-c2cc[nH]c(=O)c2)CCCCC1
InChI Key: InChIKey=PUYCOEUYHMGUKY-UHFFFAOYSA-N
Activity Spreadsheet -- Enzyme Inhibition Constant Data from BindingDB
Found 2 hits for monomerid = 192124
Trg + Lig
Ki
nM
ΔG°
kcal/mole
IC50
nM
Kd
nM
EC50/IC50
nM
koff
s-1
kon
M-1s-1
pHTemp
°C
Sphingosine 1-phosphate receptor 1
(Homo sapiens (Human))
BDBM192124
(US9187437, 2)
Show SMILES Fc1cc(F)cc(c1)C1(CCc2nc(no2)-c2cc[nH]c(=O)c2)CCCCC1
Show InChI InChI=1S/C21H21F2N3O2/c22-16-11-15(12-17(23)13-16)21(6-2-1-3-7-21)8-4-19-25-20(26-28-19)14-5-9-24-18(27)10-14/h5,9-13H,1-4,6-8H2,(H,24,27)
Reactome pathway
n/an/a 13n/an/an/an/an/an/a
Bristol-Myers Squibb Company
Curated by ChEMBL
Assay Description
Displacement of [33P]-S1P from human S1P1 receptor expressed in CHO cell membranes after 45 mins
J Med Chem 60: 5267-5289 (2017)
Article DOI: 10.1021/acs.jmedchem.6b01575
BindingDB Entry DOI: 10.7270/Q2930WM8
Sphingosine 1-phosphate receptor 1
(Homo sapiens (Human))
BDBM192124
(US9187437, 2)
Show SMILES Fc1cc(F)cc(c1)C1(CCc2nc(no2)-c2cc[nH]c(=O)c2)CCCCC1
Show InChI InChI=1S/C21H21F2N3O2/c22-16-11-15(12-17(23)13-16)21(6-2-1-3-7-21)8-4-19-25-20(26-28-19)14-5-9-24-18(27)10-14/h5,9-13H,1-4,6-8H2,(H,24,27)
Reactome pathway
US Patent
n/an/a 13n/an/an/an/a7.525
BRISTOL-MYERS SQUIBB COMPANY
US Patent
Assay Description
Membranes were prepared from CHO cells expressing human S1P1. Cells pellets (1x108 cells/pellet) were suspended in buffer containing 20 mM HEPES, pH ...
US Patent US9187437 (2015)
BindingDB Entry DOI: 10.7270/Q2JH3K0X