null
SMILES: Fc1cc(ccc1C(F)(F)F)[C@H](NC(=O)c1ccc2cnc(NC3CCOCC3)nc2c1)[C@H]1CCCN1
InChI Key: InChIKey=WPDRHVKUBYGIJD-GGAORHGYSA-N
Activity Spreadsheet -- Enzyme Inhibition Constant Data from BindingDB
Found 1 hit for monomerid = 192327
Trg + Lig
Ki
nM
ΔG°
kcal/mole
IC50
nM
Kd
nM
EC50/IC50
nM
koff
s-1
kon
M-1s-1
pHTemp
°C
Mitogen-activated protein kinase 1 [8-360]
(Homo sapiens (Human))
BDBM192327
(US9187462, I-7)
Show SMILES Fc1cc(ccc1C(F)(F)F)[C@H](NC(=O)c1ccc2cnc(NC3CCOCC3)nc2c1)[C@H]1CCCN1 |r|
Show InChI InChI=1S/C26H27F4N5O2/c27-20-12-15(5-6-19(20)26(28,29)30)23(21-2-1-9-31-21)35-24(36)16-3-4-17-14-32-25(34-22(17)13-16)33-18-7-10-37-11-8-18/h3-6,12-14,18,21,23,31H,1-2,7-11H2,(H,35,36)(H,32,33,34)/t21-,23+/m1/s1
US Patent
n/an/a 1.80n/an/an/an/a7.3n/a
Array BioPharma Inc.; Genentech, Inc.
US Patent
Assay Description
Compounds were tested in an enzymatic assay using human ERK-2 (Mitogen Activated Kinase 1), recombinantly expressed as an N-terminal 6-His fusion pro...
US Patent US9187462 (2015)
BindingDB Entry DOI: 10.7270/Q21G0K2P