BDBM192342 US9187462, I-22
SMILES: Cn1ccc(n1)[C@@H](NC(=O)c1cc(F)c2cnc(NC3CCOCC3)nc2c1)c1ccc(Cl)c(F)c1
InChI Key: InChIKey=POZTUMGUUIKXJU-QHCPKHFHSA-N
Data: 1 IC50
Activity Spreadsheet -- Enzyme Inhibition Constant Data from BindingDB
Found 1 hit for monomerid = 192342
Trg + Lig
Ki
nM
ΔG°
kcal/mole
IC50
nM
Kd
nM
EC50/IC50
nM
koff
s-1
kon
M-1s-1
pHTemp
°C
Mitogen-activated protein kinase 1 [8-360]
(Homo sapiens (Human))
BDBM192342
(US9187462, I-22)
Show SMILES Cn1ccc(n1)[C@@H](NC(=O)c1cc(F)c2cnc(NC3CCOCC3)nc2c1)c1ccc(Cl)c(F)c1 |r|
Show InChI InChI=1S/C25H23ClF2N6O2/c1-34-7-4-21(33-34)23(14-2-3-18(26)20(28)10-14)32-24(35)15-11-19(27)17-13-29-25(31-22(17)12-15)30-16-5-8-36-9-6-16/h2-4,7,10-13,16,23H,5-6,8-9H2,1H3,(H,32,35)(H,29,30,31)/t23-/m0/s1
US Patent
n/an/a 1.40n/an/an/an/a7.3n/a
Array BioPharma Inc.; Genentech, Inc.
US Patent
Assay Description
Compounds were tested in an enzymatic assay using human ERK-2 (Mitogen Activated Kinase 1), recombinantly expressed as an N-terminal 6-His fusion pro...
US Patent US9187462 (2015)
BindingDB Entry DOI: 10.7270/Q21G0K2P