BDBM192386 US9187462, I-66
SMILES: COc1ccc(cc1Cl)[C@H](NC(=O)c1cc(F)c2cnc(NC3CCOCC3)nc2c1)c1cnn(C)c1
InChI Key: InChIKey=MHIAOZLCIJNPAQ-DEOSSOPVSA-N
Data: 1 IC50
Activity Spreadsheet -- Enzyme Inhibition Constant Data from BindingDB
Found 1 hit for monomerid = 192386
Trg + Lig
Ki
nM
ΔG°
kcal/mole
IC50
nM
Kd
nM
EC50/IC50
nM
koff
s-1
kon
M-1s-1
pHTemp
°C
Mitogen-activated protein kinase 1 [8-360]
(Homo sapiens (Human))
BDBM192386
(US9187462, I-66)
Show SMILES COc1ccc(cc1Cl)[C@H](NC(=O)c1cc(F)c2cnc(NC3CCOCC3)nc2c1)c1cnn(C)c1 |r|
Show InChI InChI=1S/C26H26ClFN6O3/c1-34-14-17(12-30-34)24(15-3-4-23(36-2)20(27)9-15)33-25(35)16-10-21(28)19-13-29-26(32-22(19)11-16)31-18-5-7-37-8-6-18/h3-4,9-14,18,24H,5-8H2,1-2H3,(H,33,35)(H,29,31,32)/t24-/m0/s1
US Patent
n/an/a 0.600n/an/an/an/a7.3n/a
Array BioPharma Inc.; Genentech, Inc.
US Patent
Assay Description
Compounds were tested in an enzymatic assay using human ERK-2 (Mitogen Activated Kinase 1), recombinantly expressed as an N-terminal 6-His fusion pro...
US Patent US9187462 (2015)
BindingDB Entry DOI: 10.7270/Q21G0K2P