BDBM192442 US9187462, II-52
SMILES: COc1ccc(cc1F)[C@H](NC(=O)c1cc(F)c2cnc(NC3CCOCC3)nc2c1)c1nccn1C
InChI Key: InChIKey=BYDHXONIQCKCTI-QHCPKHFHSA-N
Data: 1 IC50
Activity Spreadsheet -- Enzyme Inhibition Constant Data from BindingDB
Found 1 hit for monomerid = 192442
Trg + Lig
Ki
nM
ΔG°
kcal/mole
IC50
nM
Kd
nM
EC50/IC50
nM
koff
s-1
kon
M-1s-1
pHTemp
°C
Mitogen-activated protein kinase 1 (aa 8-360)
(Homo sapiens (Human))
BDBM192442
(US9187462, II-52)
Show SMILES COc1ccc(cc1F)[C@H](NC(=O)c1cc(F)c2cnc(NC3CCOCC3)nc2c1)c1nccn1C |r|
Show InChI InChI=1S/C26H26F2N6O3/c1-34-8-7-29-24(34)23(15-3-4-22(36-2)20(28)11-15)33-25(35)16-12-19(27)18-14-30-26(32-21(18)13-16)31-17-5-9-37-10-6-17/h3-4,7-8,11-14,17,23H,5-6,9-10H2,1-2H3,(H,33,35)(H,30,31,32)/t23-/m0/s1
US Patent
n/an/a 1.90n/an/an/an/a7.3n/a
Array BioPharma Inc.; Genentech, Inc.
US Patent
Assay Description
Compounds were tested in an enzymatic assay using human ERK-2 (Mitogen Activated Kinase 1), recombinantly expressed as an N-terminal 6-His fusion pro...
US Patent US9187462 (2015)
BindingDB Entry DOI: 10.7270/Q21G0K2P