BDBM19246 (2S)-3-(2-chloro-4-isothiocyanatophenoxy)-2-hydroxy-2-methyl-N-[4-nitro-3-(trifluoromethyl)phenyl]propanamide::arylisothiocyanato derivative, S-30
SMILES: C[C@](O)(COc1ccc(cc1Cl)N=C=S)C(=O)Nc1ccc(c(c1)C(F)(F)F)[N+]([O-])=O
InChI Key: InChIKey=HRHIPNPECPDAEA-KRWDZBQOSA-N
Data: 1 KI
Activity Spreadsheet -- Enzyme Inhibition Constant Data from BindingDB
Found 1 hit for monomerid = 19246
Trg + Lig
Ki
nM
ΔG°
kcal/mole
IC50
nM
Kd
nM
EC50/IC50
nM
koff
s-1
kon
M-1s-1
pHTemp
°C
Androgen receptor
(Rattus norvegicus (Rat))
BDBM19246
((2S)-3-(2-chloro-4-isothiocyanatophenoxy)-2-hydrox...)
Show SMILES C[C@](O)(COc1ccc(cc1Cl)N=C=S)C(=O)Nc1ccc(c(c1)C(F)(F)F)[N+]([O-])=O |r|
Show InChI InChI=1S/C18H13ClF3N3O5S/c1-17(27,8-30-15-5-3-10(23-9-31)7-13(15)19)16(26)24-11-2-4-14(25(28)29)12(6-11)18(20,21)22/h2-7,27H,8H2,1H3,(H,24,26)/t17-/m0/s1
Reactome pathway
31.1 -9.51n/an/an/an/an/a7.44
University of Tennessee Health Science Center
Assay Description
The Ki values were determined by the application of the Cheng-Prusoff equation: Ki = (IC50 x Kd)/(Kd+[L]) where [L] is the concentration of [3H]MIB (...
Bioorg Med Chem 14: 6525-38 (2006)
Article DOI: 10.1016/j.bmc.2006.06.019
BindingDB Entry DOI: 10.7270/Q2WQ022N