BDBM192705 7-(2-hydroxy-3-(6-methoxybenzo[d]thiazol-2-ylamino)propoxy)-4-methyl-2H-chromen-2-one (35)
SMILES: COc1ccc2nc(NCC(O)COc3ccc4c(C)cc(=O)oc4c3)sc2c1
InChI Key: InChIKey=LYBOHOWDKYJPKT-UHFFFAOYSA-N
Data: 1 IC50
Activity Spreadsheet -- Enzyme Inhibition Constant Data from BindingDB
Found 1 hit for monomerid = 192705
Trg + Lig
Ki
nM
ΔG°
kcal/mole
IC50
nM
Kd
nM
EC50/IC50
nM
koff
s-1
kon
M-1s-1
pHTemp
°C
5-Lipoxygenase (5-LOX)
(Glycine max (Soybean))
BDBM192705
(7-(2-hydroxy-3-(6-methoxybenzo[d]thiazol-2-ylamino...)
Show SMILES COc1ccc2nc(NCC(O)COc3ccc4c(C)cc(=O)oc4c3)sc2c1
Show InChI InChI=1S/C21H20N2O5S/c1-12-7-20(25)28-18-8-15(3-5-16(12)18)27-11-13(24)10-22-21-23-17-6-4-14(26-2)9-19(17)29-21/h3-9,13,24H,10-11H2,1-2H3,(H,22,23)
n/an/a 2.12n/an/an/an/a9.025
Nirma University
Assay Description
It is determined by kinetic mode of spectro-photometric determination method,which was performed by recording the rate of change in absorbance at 234...
Bioorg Chem 67: 130-8 (2016)
Article DOI: 10.1016/j.bioorg.2016.06.004
BindingDB Entry DOI: 10.7270/Q2M907GG