null
SMILES: CN(C)C(=O)C(=Cc1ccc(Nc2cnc3[nH]cc(C(=O)NC(C)(C)C)c3n2)cc1)C#N
InChI Key: InChIKey=PXDGIFGYVAPLCW-XNTDXEJSSA-N
Activity Spreadsheet -- Enzyme Inhibition Constant Data from BindingDB
Found 1 hit for monomerid = 192809
Trg + Lig
Ki
nM
ΔG°
kcal/mole
IC50
nM
Kd
nM
EC50/IC50
nM
koff
s-1
kon
M-1s-1
pHTemp
°C
Tyrosine-protein kinase JAK3 [781-1124]
(Homo sapiens (Human))
BDBM192809
(US9187487, 71)
Show SMILES CN(C)C(=O)C(=Cc1ccc(Nc2cnc3[nH]cc(C(=O)NC(C)(C)C)c3n2)cc1)C#N |w:6.6|
Show InChI InChI=1S/C23H25N7O2/c1-23(2,3)29-21(31)17-12-25-20-19(17)28-18(13-26-20)27-16-8-6-14(7-9-16)10-15(11-24)22(32)30(4)5/h6-10,12-13H,1-5H3,(H,25,26)(H,27,28)(H,29,31)/b15-10+
US Patent
n/an/a 0.200n/an/an/an/a7.5-248.15
PRINCIPIA BIOPHARMA, INC.
US Patent
Assay Description
Phosphorylation of the appropriate peptide substrate (fluorescently labeled Srctide) by recombinant JAK3 (catalytic domain, aa 781-1124) was measured...
US Patent US9187487 (2015)
BindingDB Entry DOI: 10.7270/Q2K936B3