BDBM192818 US9187487, 83
SMILES: CC(C)NC(=O)c1c[nH]c2ncc(Nc3ccc(C=C(C#N)C(=O)N4CCNCC4)cc3)nc12
InChI Key: InChIKey=OBLFWADPWPFGKC-GZTJUZNOSA-N
Data: 1 IC50
Activity Spreadsheet -- Enzyme Inhibition Constant Data from BindingDB
Found 1 hit for monomerid = 192818
Trg + Lig
Ki
nM
ΔG°
kcal/mole
IC50
nM
Kd
nM
EC50/IC50
nM
koff
s-1
kon
M-1s-1
pHTemp
°C
Tyrosine-protein kinase JAK3 [781-1124]
(Homo sapiens (Human))
BDBM192818
(US9187487, 83)
Show SMILES CC(C)NC(=O)c1c[nH]c2ncc(Nc3ccc(C=C(C#N)C(=O)N4CCNCC4)cc3)nc12 |w:18.17|
Show InChI InChI=1S/C24H26N8O2/c1-15(2)29-23(33)19-13-27-22-21(19)31-20(14-28-22)30-18-5-3-16(4-6-18)11-17(12-25)24(34)32-9-7-26-8-10-32/h3-6,11,13-15,26H,7-10H2,1-2H3,(H,27,28)(H,29,33)(H,30,31)/b17-11+
US Patent
n/an/a 0.200n/an/an/an/a7.5-248.15
PRINCIPIA BIOPHARMA, INC.
US Patent
Assay Description
Phosphorylation of the appropriate peptide substrate (fluorescently labeled Srctide) by recombinant JAK3 (catalytic domain, aa 781-1124) was measured...
US Patent US9187487 (2015)
BindingDB Entry DOI: 10.7270/Q2K936B3